Mozilla build fails in mozilla/gfx directory

RESOLVED WONTFIX

Status

Core Graveyard
GFX
--
major
RESOLVED WONTFIX
12 years ago
3 years ago

People

(Reporter: Laxmi Harikumar, Unassigned)

Tracking

Firefox Tracking Flags

(Not tracked)

Details

(Reporter)

Description

12 years ago
User-Agent:       Mozilla/5.0 (Windows; U; Windows NT 5.1; en-US; rv:1.8.0.1) Gecko/20060111 Firefox/1.5.0.1
Build Identifier: 

With svg enabled, I get the following build error in mozilla/gfx directory.

Building deps for nsRegionImpl.cpp
cxx -o nsRegionImpl.o -c  -DMOZILLA_INTERNAL_API -DOSTYPE=\"OSF1V5\" -DOSARCH=\"
OSF1\" -DBUILD_ID=0000000000 -D_IMPL_NS_GFX  -I../../dist/include/xpcom -I../../
dist/include/windowwatcher -I../../dist/include/dom -I../../dist/include/string
-I../../dist/include/widget -I../../dist/include/locale -I../../dist/include/vie
w -I../../dist/include/pref -I../../dist/include/unicharutil -I../../dist/includ
e/uconv -I../../dist/include   -I../../dist/include/gfx -I../../dist/include/nsp
r    -I../../dist/sdk/include       -noexceptions -ieee -ptr ../../dist/cxx_repo
sitory  -DDEBUG -D_DEBUG -DDEBUG_dailybld -DTRACING -g   -DHAVE_64BIT_OS=1 -DMOZ
ILLA_VERSION=\"1.9a1\" -DMOZILLA_VERSION_U=1.9a1 -DNSCAP_DISABLE_TEST_DONTQUERY_
CASES=1 -DNSCAP_DISABLE_DEBUG_PTR_TYPES=1 -DNEED_USLEEP_PROTOTYPE=1 -DD_INO=d_in
o -DSTDC_HEADERS=1 -DHAVE_ST_BLKSIZE=1 -DHAVE_SIGINFO_T=1 -DHAVE_UINT=1 -DHAVE_U
INT_T=1 -DHAVE_DIRENT_H=1 -DHAVE_GETOPT_H=1 -DHAVE_SYS_BITYPES_H=1 -DHAVE_MEMORY
_H=1 -DHAVE_UNISTD_H=1 -DHAVE_NL_TYPES_H=1 -DHAVE_MALLOC_H=1 -DHAVE_X11_XKBLIB_H
=1 -DHAVE_SYS_STATVFS_H=1 -DHAVE_LIBC_R=1 -DHAVE_LIBM=1 -DFUNCPROTO=15 -DHAVE_XS
HM=1 -DHAVE_RANDOM=1 -DHAVE_STRERROR=1 -DHAVE_LCHOWN=1 -DHAVE_FCHMOD=1 -DHAVE_SN
PRINTF=1 -DHAVE_MEMMOVE=1 -DHAVE_RINT=1 -DHAVE_FLOCKFILE=1 -DHAVE_LOCALTIME_R=1
-DHAVE_STRTOK_R=1 -DHAVE_LANGINFO_CODESET=1 -DNEED_CPP_DERIVED_TEMPLATE_OPERATOR
S=1 -DNEED_CPP_TEMPLATE_CAST_TO_BASE=1 -DCANT_RESOLVE_CPP_CONST_AMBIGUITY=1 -DHA
VE_I18N_LC_MESSAGES=1 -DMOZ_DEFAULT_TOOLKIT=\"gtk\" -DMOZ_WIDGET_GTK=1 -DMOZ_ENA
BLE_XREMOTE=1 -DMOZ_X11=1 -DMOZ_SUITE=1 -DMOZ_BUILD_APP=suite -DMOZ_DISTRIBUTION
_ID=\"org.mozilla\" -DMOZ_ENABLE_COREXFONTS=1 -DMOZ_EXTRA_X11CONVERTERS=1 -DOJI=
1 -DIBMBIDI=1 -DMOZ_VIEW_SOURCE=1 -DACCESSIBILITY=1 -DMOZ_XPINSTALL=1 -DMOZ_JSLO
ADER=1 -DNS_PRINTING=1 -DNS_PRINT_PREVIEW=1 -DMOZ_XTF=1 -DMOZ_MATHML=1 -DMOZ_ENA
BLE_CANVAS=1 -DMOZ_SVG=1 -DMOZ_SVG_RENDERER_CAIRO=1 -DMOZ_UPDATE_CHANNEL=default
 -DMOZ_LOGGING=1 -DDETECT_WEBSHELL_LEAKS=1 -DMOZ_USER_DIR=\".mozilla\" -DNSCAP_D
ONT_PROVIDE_NONCONST_OPEQ=1 -DHAVE_INTTYPES_H=1 -DHAVE_UINT64_T=1 -DMOZ_XUL=1 -D
MOZ_PROFILELOCKING=1 -DMOZ_MORK=1 -DMOZ_DLL_SUFFIX=\".so\" -DXP_UNIX=1 -DUNIX_AS
YNC_DNS=1 -DJS_THREADSAFE=1 -DMOZ_REFLOW_PERF=1 -DMOZ_REFLOW_PERF_DSP=1 -DMOZILL
A_LOCALE_VERSION=\"1.9a1\" -DMOZILLA_REGION_VERSION=\"1.9a1\" -DMOZILLA_SKIN_VER
SION=\"1.8\"  -D_MOZILLA_CONFIG_H_ -DMOZILLA_CLIENT nsRegionImpl.cpp
cxx: Error: ../../dist/include/gfx/nsRegion.h, line 85: function
          "nsRegion::RgnRect::operator delete" was referenced but not defined
    inline void  operator delete (void* aRect, size_t);
-----------------^
cxx: Info: 1 error detected in the compilation of "nsRegionImpl.cpp".
gmake[4]: *** [nsRegionImpl.o] Error 1
gmake[4]: Leaving directory `/usr/users/dailybld/mozilla/gfx/src'
gmake[3]: *** [libs] Error 2
gmake[3]: Leaving directory `/usr/users/dailybld/mozilla/gfx'
gmake[2]: *** [libs_tier_9] Error 2
gmake[2]: Leaving directory `/usr/users/dailybld/mozilla'
gmake[1]: *** [tier_9] Error 2
gmake[1]: Leaving directory `/usr/users/dailybld/mozilla'
gmake: *** [default] Error 2
$


This is my .mozconfig file
ac_add_options --enable-tests
ac_add_options --enable-debug
ac_add_options --disable-optimize
ac_add_options --enable-svg
ac_add_options --enable-crypto
ac_add_options --enable-ipv6
ac_add_options --enable-freetype2
ac_add_options --enable-default-toolkit=gtk
mk_add_options MOZ_CO_PROJECT=suite
ac_add_options --enable-application=suite




Reproducible: Always

Steps to Reproduce:
1. Run make in mozilla/gfx directory
2. 
3.

Actual Results:  
Build fails in mozilla/gfx

Expected Results:  
Build should have completed successfully in mozilla/gfx
(Reporter)

Comment 1

12 years ago
This bug occurs in DEC OSF1
OS: Other → OSF/1
Hardware: Other → DEC
Status: UNCONFIRMED → NEW
Ever confirmed: true
Product: Core → Core Graveyard
This bug has been buried in the graveyard and has not been updated in over 5 years. It is probably safe to assume that it will never be fixed, so resolving as WONTFIX.

[Mass-change filter: graveyard-wontfix-2014-09-24]
Status: NEW → RESOLVED
Last Resolved: 3 years ago
Resolution: --- → WONTFIX
You need to log in before you can comment on or make changes to this bug.