.../build/config/nsinstall: cannot access ../../dist/lib/libsoftokn3.chk: No such file

RESOLVED WONTFIX

Status

Minimo
Build Config
RESOLVED WONTFIX
11 years ago
10 years ago

People

(Reporter: I Gusti Ngurah Agung Bagus Andika, Assigned: dougt)

Tracking

Details

(Reporter)

Description

11 years ago
User-Agent:       Mozilla/5.0 (X11; U; Linux i686; ja; rv:1.8.1.3) Gecko/20060601 Firefox/2.0.0.3 (Ubuntu-edgy)
Build Identifier: 

Build stop with message ./../dist/lib/libsoftokn3.chk: No such File or Directory

Reproducible: Always

Steps to Reproduce:
1.cvs -d :pserver:anonymous@cvs-mirror.mozilla.org:/cvsroot co -r MOZILLA_1_8_0_BRANCH mozilla/client.mk mozilla/minimo/config
2.make -f client.mk checkout
3.make -f client.mk build
Actual Results:  
cd mangle; /scratchbox/tools/bin/make -j1 libs
make[5]: Entering directory `/home/gusti/minimo/mozilla/security/nss/cmd/shlibsign/mangle'
gcc -o /home/gusti/minimo/build/nss/mangle -O2 -fPIC -DLINUX1_2 -D_XOPEN_SOURCE -DLINUX2_1  -ansi -Wall -pipe -DLINUX -Dlinux -D_POSIX_SOURCE -D_BSD_SOURCE -DHAVE_STRERROR -DXP_UNIX -DSHLIB_SUFFIX=\"so\" -DSHLIB_PREFIX=\"lib\" -UDEBUG -DNDEBUG -D_REENTRANT -I/home/gusti/minimo/build/dist/include  -I/home/gusti/minimo/build/dist/public/nss -I/home/gusti/minimo/build/dist/private/nss -I/home/gusti/minimo/build/dist/include -I/home/gusti/minimo/build/dist/include/nspr -I/home/gusti/minimo/build/dist/include/dbm  /home/gusti/minimo/build/nss/mangle.o  /home/gusti/minimo/build/dist/lib/libsmime.a /home/gusti/minimo/build/dist/lib/libssl.a /home/gusti/minimo/build/dist/lib/libnss.a /home/gusti/minimo/build/dist/lib/libssl.a /home/gusti/minimo/build/dist/lib/libsectool.a /home/gusti/minimo/build/dist/lib/libpkcs12.a /home/gusti/minimo/build/dist/lib/libpkcs7.a /home/gusti/minimo/build/dist/lib/libcerthi.a /home/gusti/minimo/build/dist/lib/libpk11wrap.a /home/gusti/minimo/build/dist/lib/libcryptohi.a /home/gusti/minimo/build/dist/lib/libcerthi.a /home/gusti/minimo/build/dist/lib/libnsspki.a /home/gusti/minimo/build/dist/lib/libpk11wrap.a /home/gusti/minimo/build/dist/lib/libsoftokn.a /home/gusti/minimo/build/dist/lib/libcertdb.a /home/gusti/minimo/build/dist/lib/libnsspki.a /home/gusti/minimo/build/dist/lib/libnssdev.a /home/gusti/minimo/build/dist/lib/libnssb.a /home/gusti/minimo/build/dist/lib/libfreebl.a /home/gusti/minimo/build/dist/lib/libsecutil.a /home/gusti/minimo/build/dist/lib/libdbm.a  -Wl,-rpath,'$ORIGIN/../lib' -L/home/gusti/minimo/build/dist/lib -lplc4 -lplds4 -lnspr4  -lpthread  -ldl -lc
/home/gusti/minimo/build/nss/nsinstall -R -m 775 /home/gusti/minimo/build/nss/mangle /home/gusti/minimo/build/dist/bin
make[5]: Leaving directory `/home/gusti/minimo/mozilla/security/nss/cmd/shlibsign/mangle'
cd /home/gusti/minimo/build/nss ; sh /home/gusti/minimo/mozilla/security/nss/cmd/shlibsign/./sign.sh /home/gusti/minimo/build/dist \
/home/gusti/minimo/build/nss Linux \
/home/gusti/minimo/build/dist/lib /home/gusti/minimo/build/dist/lib/libsoftokn3.so
/home/gusti/minimo/build/nss/shlibsign -v -i /home/gusti/minimo/build/dist/lib/libsoftokn3.so
cd /home/gusti/minimo/build/nss ; sh /home/gusti/minimo/mozilla/security/nss/cmd/shlibsign/./sign.sh /home/gusti/minimo/build/dist \
/home/gusti/minimo/build/nss Linux \
/home/gusti/minimo/build/dist/lib /home/gusti/minimo/build/dist/lib/libfreebl3.so
/home/gusti/minimo/build/nss/shlibsign -v -i /home/gusti/minimo/build/dist/lib/libfreebl3.so
make[4]: Leaving directory `/home/gusti/minimo/mozilla/security/nss/cmd/shlibsign'
/home/gusti/minimo/build/config/nsinstall -R -m 755 ../../dist/lib/libnssckbi.so ../../dist/gre
/home/gusti/minimo/build/config/nsinstall -R -m 644 ../../dist/lib/libsoftokn3.chk ../../dist/gre
/home/gusti/minimo/build/config/nsinstall: cannot access ../../dist/lib/libsoftokn3.chk: No such file or directory
make[3]: *** [libs] Error 1
make[3]: Leaving directory `/home/gusti/minimo/build/security/manager'
make[2]: *** [tier_50] Error 2
make[2]: Leaving directory `/home/gusti/minimo/build'
make[1]: *** [default] Error 2
make[1]: Leaving directory `/home/gusti/minimo/build'
make: *** [build] Error 2


Expected Results:  
Build succesfull
(Reporter)

Comment 1

11 years ago
my mozconfig

mk_add_options MOZ_CO_PROJECT=minimo
mk_add_options MOZ_OBJDIR=../build
ac_add_options --enable-application=minimo


# use GTK+-2 widget set with XFT font rendering
ac_add_options --enable-default-toolkit=gtk2
ac_add_options --enable-xft
ac_add_options --disable-freetype2

ac_add_options --enable-optimize=-Os
ac_add_options --enable-strip
#ac_add_options --disable-debug
ac_add_options --enable-reorder
ac_add_options --enable-elf-dynstr-gc

# enable static build
ac_add_options --disable-shared
ac_add_options --enable-static

# remove link dependency on libstdc++.so
LIBS=-lsupc++
CXX=gcc
(Assignee)

Comment 2

10 years ago
minimo component is now closed and the minimo project isn't going to be supported.  New work has started on a new mobile effort.  Please see schrep's posting for more info.  We hope you will be involved.

http://weblogs.mozillazine.org/schrep/archives/2007/10/mozilla_and_mobile.html
Status: UNCONFIRMED → RESOLVED
Last Resolved: 10 years ago
Resolution: --- → WONTFIX
You need to log in before you can comment on or make changes to this bug.