Status

()

Firefox
General
RESOLVED WONTFIX
10 years ago
10 years ago

People

(Reporter: Alan Pae, Unassigned)

Tracking

Firefox Tracking Flags

(Not tracked)

Details

(URL)

(Reporter)

Description

10 years ago
User-Agent:       Mozilla/5.0 (X11; U; SunOS i86pc; en-US; rv:1.9b5) Gecko/2008042813 Firefox/3.0b5
Build Identifier: Mozilla/5.0 (X11; U; SunOS i86pc; en-US; rv:1.9b5) Gecko/2008042813 Firefox/3.0b5

This is the output of gmake installer for Firefox 3.05 beta:

The compiler is Sun Studio 12 if it makes a difference.

# gmake installer
gmake[1]: Entering directory `/build/mozilla/obj-firefox/browser/installer'
/usr/bin/gmake -C unix
gmake[2]: Entering directory `/build/mozilla/obj-firefox/browser/installer/unix'
/build/mozilla/obj-firefox/config/nsinstall -D instgen
/build/mozilla/obj-firefox/config/nsinstall -R /build/mozilla/toolkit/locales/en-US/installer/unix/install.it /build/mozilla/browser/installer/unix/abe.jst /build/mozilla/browser/installer/unix/adt.jst /build/mozilla/browser/installer/unix/browser.jst /build/mozilla/browser/installer/unix/talkback.jst /build/mozilla/browser/installer/unix/xpcom.jst instgen
set -e;  \
        for i in packages-static installer.cfg config.it ; do \
          /usr/bin/perl /build/mozilla/config/preprocessor.pl -DAB_CD=en-US -DPKG_BASENAME=firefox-3.0b5.en-US.solaris2.11-i386 -DMOZ_APP_VERSION=3.0b5 -DMOZ_APP_NAME=firefox -DOSTYPE=\"SunOS5\" -DOSARCH=SunOS -DMOZILLA_VERSION=\"1.9b5\" -DMOZILLA_VERSION_U=1.9b5 -DSOLARIS=1 -DNSCAP_DISABLE_DEBUG_PTR_TYPES=1 -DD_INO=d_ino -DSTDC_HEADERS=1 -DHAVE_ST_BLKSIZE=1 -DHAVE_SIGINFO_T=1 -DHAVE_INT16_T=1 -DHAVE_INT32_T=1 -DHAVE_INT64_T=1 -DHAVE_UINT=1 -DHAVE_UINT_T=1 -DHAVE_UINT16_T=1 -DHAVE_DIRENT_H=1 -DHAVE_SYS_BYTEORDER_H=1 -DHAVE_GETOPT_H=1 -DHAVE_MEMORY_H=1 -DHAVE_UNISTD_H=1 -DHAVE_NL_TYPES_H=1 -DHAVE_MALLOC_H=1 -DHAVE_X11_XKBLIB_H=1 -DHAVE_SYS_STATVFS_H=1 -DHAVE_SYS_STATFS_H=1 -DHAVE_MMINTRIN_H=1 -DHAVE_LIBM=1 -DHAVE_LIBDL=1 -DHAVE_DLADDR=1 -DHAVE_LIBSOCKET=1 -DFUNCPROTO=15 -DHAVE_XSHM=1 -DHAVE_FT_BITMAP_SIZE_Y_PPEM=1 -DHAVE_FT_GLYPHSLOT_EMBOLDEN=1 -DHAVE_FT_LOAD_SFNT_TABLE=1 -D_REENTRANT=1 -DHAVE_RANDOM=1 -DHAVE_STRERROR=1 -DHAVE_LCHOWN=1 -DHAVE_FCHMOD=1 -DHAVE_SNPRINTF=1 -DHAVE_MEMMOVE=1 -DHAVE_RINT=1 -DHAVE_STAT64=1 -DHAVE_LSTAT64=1 -DHAVE_TRUNCATE64=1 -DHAVE_FLOCKFILE=1 -DHAVE_LOCALTIME_R=1 -DHAVE_STRTOK_R=1 -DHAVE_LANGINFO_CODESET=1 -DVA_COPY=va_copy -DHAVE_VA_COPY=1 -DHAVE_I18N_LC_MESSAGES=1 -DMOZ_EMBEDDING_LEVEL_DEFAULT=1 -DMOZ_EMBEDDING_LEVEL_BASIC=1 -DMOZ_EMBEDDING_LEVEL_MINIMAL=1 -DMOZ_PHOENIX=1 -DMOZ_BUILD_APP=browser -DMOZ_XUL_APP=1 -DMOZ_DEFAULT_TOOLKIT=\"cairo-gtk2\" -DMOZ_WIDGET_GTK2=1 -DMOZ_ENABLE_XREMOTE=1 -DMOZ_X11=1 -DMOZ_DISTRIBUTION_ID=\"org.mozilla\" -DMOZ_ENABLE_GNOMEUI=1 -DMOZ_ENABLE_DBUS=1 -DOJI=1 -DIBMBIDI=1 -DMOZ_VIEW_SOURCE=1 -DACCESSIBILITY=1 -DMOZ_XPINSTALL=1 -DMOZ_JSLOADER=1 -DNS_PRINTING=1 -DNS_PRINT_PREVIEW=1 -DMOZ_NO_XPCOM_OBSOLETE=1 -DMOZ_XTF=1 -DMOZ_CRASHREPORTER=1 -DHAVE_CURL_CURL_H=1 -DMOZ_MATHML=1 -DMOZ_ENABLE_CANVAS=1 -DMOZ_SVG=1 -DMOZ_SVG_FOREIGNOBJECT=1 -DMOZ_UPDATE_CHANNEL=default -DMOZ_PLACES=1 -DMOZ_FEEDS=1 -DMOZ_STORAGE=1 -DMOZ_SAFE_BROWSING=1 -DMOZ_URL_CLASSIFIER=1 -DMOZ_LOGGING=1 -DMOZ_USER_DIR=\".mozilla\" -DMOZ_ENABLE_LIBXUL=1 -DHAVE_STDINT_H=1 -DHAVE_INTTYPES_H=1 -DHAVE_SYS_INT_TYPES_H=1 -DMOZ_TREE_CAIRO=1 -DHAVE_UINT64_T=1 -DMOZ_XUL=1 -DMOZ_PROFILELOCKING=1 -DMOZ_RDF=1 -DMOZ_MORKREADER=1 -DMOZ_DLL_SUFFIX=\".so\" -DXP_UNIX=1 -DUNIX_ASYNC_DNS=1 -DJS_THREADSAFE=1 -DMOZ_ACCESSIBILITY_ATK=1 -DATK_MAJOR_VERSION=1 -DATK_MINOR_VERSION=20 -DATK_REV_VERSION=0 -DMOZILLA_LOCALE_VERSION=\"1.9a1\" -DMOZILLA_REGION_VERSION=\"1.9a1\" -DMOZILLA_SKIN_VERSION=\"1.8\"  -I/build/mozilla/browser/locales/en-US/installer/installer.inc /build/mozilla/browser/installer/unix/$i > instgen/$i; \
        done
/build/mozilla/config/preprocessor.pl:/build/mozilla/browser/installer/unix/packages-static:18: error using substitution: variable 'PREF_DIR' is not defined

gmake[2]: *** [installer] Error 1
gmake[2]: Leaving directory `/build/mozilla/obj-firefox/browser/installer/unix'
gmake[1]: *** [installer] Error 2
gmake[1]: Leaving directory `/build/mozilla/obj-firefox/browser/installer'
gmake: *** [installer] Error 2


Reproducible: Always

Steps to Reproduce:
1.compile normally and then try to make the installer package
2.
3.
Actual Results:  
fails

Expected Results:  
makes the tar.gz file for easy installation

Solaris find does not support -xtype but gnu findutils does so gmake install is a workaround but the disk footprint is 35 mb's as opposed to about 12 for gmake installer.

Comment 1

10 years ago
Firefox 3 on Solaris doesn't support "gmake installer".
Please use "gmake package" instead.
Status: UNCONFIRMED → RESOLVED
Last Resolved: 10 years ago
Resolution: --- → WONTFIX
You need to log in before you can comment on or make changes to this bug.