compile error in: mozilla/js/jsd/jsd_xpc.cpp

RESOLVED FIXED in mozilla1.9.1a2

Status

()

Core
DOM
RESOLVED FIXED
10 years ago
10 years ago

People

(Reporter: ul, Assigned: ul)

Tracking

({platform})

Trunk
mozilla1.9.1a2
Other
AIX
platform
Points:
---

Firefox Tracking Flags

(Not tracked)

Details

Attachments

(1 attachment, 1 obsolete attachment)

(Assignee)

Description

10 years ago
User-Agent:       Mozilla/5.0 (X11; U; AIX 5.1; en-US; rv:1.8.1.16) Gecko/20080711 SeaMonkey/1.1.11
Build Identifier: CVS tag FIREFOX_3_0_1_RELEASE source

build stops with error on AIX 5.1

Reproducible: Always

Steps to Reproduce:
1. Compile on AIX 5.1 with VACPP 6

Actual Results:  
xlC_r -o jsd_xpc.o -c  -DXPCOM_TRANSLATE_NSGM_ENTRY_POINT=1 -DMOZILLA_INTERNAL_API -D_IMPL_NS_COM -DEXPORT_XPT_API -DEXPORT_XPTC_API -D_IMPL_NS_COM_OBSOLETE -D_IMPL_NS_GFX -D_IMPL_NS_WIDGET -DIMPL_XREAPI -DIMPL_NS_NET -DIMPL_THEBES  -DOSTYPE=\"AIX5.1\" -DOSARCH=AIX -DEXPORT_JSD_API  -I/home/ulink/Src/mozilla/js/jsd -I. -I../../dist/include/js -I../../dist/include/string -I../../dist/include/xpcom -I../../dist/include/xpconnect -I../../dist/include/widget -I../../dist/include/dom -I../../dist/include   -I../../dist/include/jsdebug -I../../dist/include/nspr     -I../../dist/sdk/include   -qflag=w:w      -DNDEBUG -DTRIMMED -O2 -q32 -qarch=com -qalign=full -qalias=noansi -qlanglvl=stdc99 -qmaxmem=-1   -DMOZILLA_VERSION=\"1.9.0.1\" -DMOZILLA_VERSION_U=1.9.0.1 -DAIX=1 -DHAVE_SYS_INTTYPES_H=1 -DNSCAP_DISABLE_DEBUG_PTR_TYPES=1 -DD_INO=d_ino -DSTDC_HEADERS=1 -DHAVE_ST_BLKSIZE=1 -DHAVE_SIGINFO_T=1 -DHAVE_INT16_T=1 -DHAVE_INT32_T=1 -DHAVE_INT64_T=1 -DHAVE_INT64=1 -DHAVE_UINT=1 -DHAVE_UINT_T=1 -DHAVE_UINT16_T=1 -DHAVE_DIRENT_H=1 -DHAVE_MEMORY_H=1 -DHAVE_UNISTD_H=1 -DHAVE_NL_TYPES_H=1 -DHAVE_MALLOC_H=1 -DHAVE_X11_XKBLIB_H=1 -DHAVE_SYS_STATVFS_H=1 -DHAVE_SYS_STATFS_H=1 -DHAVE_LIBC_R=1 -DHAVE_LIBM=1 -DHAVE_LIBDL=1 -DHAVE_LIBC_R=1 -DFUNCPROTO=15 -DHAVE_XSHM=1 -DHAVE_FT_BITMAP_SIZE_Y_PPEM=1 -DHAVE_FT_LOAD_SFNT_TABLE=1 -D_REENTRANT=1 -DHAVE_RANDOM=1 -DHAVE_STRERROR=1 -DHAVE_LCHOWN=1 -DHAVE_FCHMOD=1 -DHAVE_SNPRINTF=1 -DHAVE_MEMMOVE=1 -DHAVE_RINT=1 -DHAVE_STAT64=1 -DHAVE_LSTAT64=1 -DHAVE_TRUNCATE64=1 -DHAVE_FLOCKFILE=1 -DHAVE_LOCALTIME_R=1 -DHAVE_STRTOK_R=1 -DHAVE_RES_NINIT=1 -DHAVE_LANGINFO_CODESET=1 -DHAVE_I18N_LC_MESSAGES=1 -DMOZ_EMBEDDING_LEVEL_DEFAULT=1 -DMOZ_EMBEDDING_LEVEL_BASIC=1 -DMOZ_EMBEDDING_LEVEL_MINIMAL=1 -DMOZ_PHOENIX=1 -DMOZ_BUILD_APP=browser -DMOZ_XUL_APP=1 -DMOZ_DEFAULT_TOOLKIT=\"cairo-gtk2\" -DMOZ_WIDGET_GTK2=1 -DMOZ_ENABLE_XREMOTE=1 -DMOZ_X11=1 -DMOZ_DISTRIBUTION_ID=\"org.mozilla\" -DMOZ_ENABLE_GCONF=1 -DMOZ_ENABLE_GNOMEUI=1 -DMOZ_ENABLE_DBUS=1 -DOJI=1 -DIBMBIDI=1 -DMOZ_VIEW_SOURCE=1 -DACCESSIBILITY=1 -DMOZ_XPINSTALL=1 -DMOZ_JSLOADER=1 -DNS_PRINTING=1 -DNS_PRINT_PREVIEW=1 -DMOZ_NO_XPCOM_OBSOLETE=1 -DMOZ_XTF=1 -DMOZ_CRASHREPORTER_ENABLE_PERCENT=100 -DMOZ_MATHML=1 -DMOZ_ENABLE_CANVAS=1 -DMOZ_SVG=1 -DMOZ_SVG_FOREIGNOBJECT=1 -DMOZ_UPDATE_CHANNEL=default -DMOZ_PLACES=1 -DMOZ_FEEDS=1 -DMOZ_STORAGE=1 -DMOZ_SAFE_BROWSING=1 -DMOZ_URL_CLASSIFIER=1 -DMOZ_LOGGING=1 -DMOZ_USER_DIR=\".mozilla\" -DMOZ_ENABLE_LIBXUL=1 -DHAVE_INTTYPES_H=1 -DMOZ_TREE_CAIRO=1 -DHAVE_UINT64_T=1 -DMOZ_XUL=1 -DMOZ_PROFILELOCKING=1 -DMOZ_RDF=1 -DMOZ_MORKREADER=1 -DMOZ_DLL_SUFFIX=\".so\" -DXP_UNIX=1 -DUNIX_ASYNC_DNS=1 -DJS_THREADSAFE=1 -DMOZ_ACCESSIBILITY_ATK=1 -DATK_MAJOR_VERSION=1 -DATK_MINOR_VERSION=12 -DATK_REV_VERSION=3 -DMOZILLA_LOCALE_VERSION=\"1.9a1\" -DMOZILLA_REGION_VERSION=\"1.9a1\" -DMOZILLA_SKIN_VERSION=\"1.8\"  -D_MOZILLA_CONFIG_H_ -DMOZILLA_CLIENT /home/ulink/Src/mozilla/js/jsd/jsd_xpc.cpp
"../../dist/include/dom/nsIScriptGlobalObject.h", line 54.6: 1540-0029 (S) The named enumeration is not defined.
gmake[4]: *** [jsd_xpc.o] Error 1
gmake[4]: Leaving directory `/home/ulink/Src/mozilla/AIX-51/com/js/jsd'
gmake[3]: *** [libs_tier_gecko] Error 2
gmake[3]: Leaving directory `/home/ulink/Src/mozilla/AIX-51/com'
gmake[2]: *** [tier_gecko] Error 2
gmake[2]: Leaving directory `/home/ulink/Src/mozilla/AIX-51/com'
gmake[1]: *** [default] Error 2
gmake[1]: Leaving directory `/home/ulink/Src/mozilla/AIX-51/com'
gmake: *** [build] Error 2


Expected Results:  
successful compilation
(Assignee)

Updated

10 years ago
Keywords: helpwanted, platform
(Assignee)

Comment 1

10 years ago
Created attachment 331504 [details] [diff] [review]
removes empty declaration of enum nsEventStatus

the removed "enum nsEventStatus" is available through the included "nsEvent.h" header
Attachment #331504 - Flags: review?(peterv)
(Assignee)

Updated

10 years ago
Component: General → DOM
Product: Firefox → Core
Version: unspecified → 1.9.0 Branch
Comment on attachment 331504 [details] [diff] [review]
removes empty declaration of enum nsEventStatus

Just remove that line completely instead of commenting it out.
Attachment #331504 - Flags: review?(peterv) → review+
(Assignee)

Comment 3

10 years ago
Created attachment 332404 [details] [diff] [review]
removes empty declaration of enum nsEventStatus

Line removed that was commented out before
Attachment #331504 - Attachment is obsolete: true
(Assignee)

Updated

10 years ago
Keywords: helpwanted → checkin-needed
(Assignee)

Updated

10 years ago
Version: 1.9.0 Branch → Trunk
Assignee: nobody → ul.mcamafia
Status: UNCONFIRMED → NEW
Ever confirmed: true
(Assignee)

Updated

10 years ago
Status: NEW → ASSIGNED
Pushed as 17111:8857aa1cdb0e.
Status: ASSIGNED → RESOLVED
Last Resolved: 10 years ago
Keywords: checkin-needed
QA Contact: general → general
Resolution: --- → FIXED
Target Milestone: --- → mozilla1.9.1a2
You need to log in before you can comment on or make changes to this bug.