Closed Bug 49731 Opened 26 years ago Closed 26 years ago

embed smoketest failed to execute

Categories

(Core Graveyard :: Embedding: APIs, defect, P3)

x86
Linux
defect

Tracking

(Not tracked)

VERIFIED INVALID

People

(Reporter: tracy, Assigned: dougt)

Details

(Keywords: embed, smoketest, Whiteboard: [dogfood+][nsbeta3+])

segmentation fault cannot open shared object file
Keywords: embed, nsbeta3, smoketest
well, the actual problem is missing zlib ************************************************** nsNativeComponentLoader: SelfRegisterDll(/home/dougt/temp/components/libcaps.so) Load FAILED with error: libzlib.so: cannot open shared object file: No such file or directory ************************************************** ************************************************** nsNativeComponentLoader: SelfRegisterDll(/home/dougt/temp/components/libnecko.so) Load FAILED with error: libzlib.so: cannot open shared object file: No such file or directory ************************************************** Warning: MOZILLA_FIVE_HOME not set.
Putting on [dogfood+][nsbeta3-] radar. We need this fixed ASAP to run this test daily.
Whiteboard: [dogfood+][nsbeta3-]
plussing
Assignee: valeski → dougt
Whiteboard: [dogfood+][nsbeta3-] → [dogfood+][nsbeta3+]
fix is in. try again tomorrow. if it still doesn't work, reopen.
Status: NEW → RESOLVED
Closed: 26 years ago
Resolution: --- → FIXED
tested build 2000-08-21-21-M18 -- failed error in loading shared libraries: libplds4.so: cannot open shared object file: no such file or directory.
Status: RESOLVED → REOPENED
Resolution: FIXED → ---
you did not set your environment up correct: Try: setenv LD_LIBRARY_PATH .
Status: REOPENED → RESOLVED
Closed: 26 years ago → 26 years ago
Resolution: --- → INVALID
okay...did that..now getting nsNativeComponentLoader: GetFactory(liboji.so) Load FAILED with error: liboji.so: cannot open shared file: no such file or directory
okay. you should get passed these warnings. there should be a very small window that appears with the title "Embedding is Fun!". Do you see this? Also two bugs that you should open: 1. gtkEmbed window is too small 2. embedding test case complains about missing oji.
Status: RESOLVED → REOPENED
Resolution: INVALID → ---
Marking as invalid as I was not performing all the required steps to get this running. It works fine as of build: Linux 2000-08-023-06-M18
Status: REOPENED → RESOLVED
Closed: 26 years ago → 26 years ago
Resolution: --- → INVALID
marking verified invalid
Status: RESOLVED → VERIFIED
Product: Core → Core Graveyard
You need to log in before you can comment on or make changes to this bug.