unresolved symbol _secmod_GetInternalModule

RESOLVED FIXED in 3.1

Status

NSS
Libraries
P3
blocker
RESOLVED FIXED
18 years ago
18 years ago

People

(Reporter: Markus Doehr, Assigned: Robert Relyea)

Tracking

x86
Windows 2000

Firefox Tracking Flags

(Not tracked)

Details

(Reporter)

Description

18 years ago
I'm trying to compile NSS under Windows 2000 SP1. While linking this error is 
produced:

/out:WIN954.0_OPT.OBJ/instinit.exe
../../../../../dist/WIN954.0_OPT.OBJ/lib/smime.lib
../../../../../dist/WIN954.0_OPT.OBJ/lib/ssl.lib
../../../../../dist/WIN954.0_OPT.OBJ/lib/jar.lib
../../../../../dist/WIN954.0_OPT.OBJ/lib/zlib.lib
../../../../../dist/WIN954.0_OPT.OBJ/lib/nss.lib
../../../../../dist/WIN954.0_OPT.OBJ/lib/ssl.lib
../../../../../dist/WIN954.0_OPT.OBJ/lib/sectool.lib
../../../../../dist/WIN954.0_OPT.OBJ/lib/pkcs7.lib
../../../../../dist/WIN954.0_OPT.OBJ/lib/certhi.lib
../../../../../dist/WIN954.0_OPT.OBJ/lib/cryptohi.lib
../../../../../dist/WIN954.0_OPT.OBJ/lib/pk11wrap.lib
../../../../../dist/WIN954.0_OPT.OBJ/lib/certdb.lib
../../../../../dist/WIN954.0_OPT.OBJ/lib/softoken.lib
../../../../../dist/WIN954.0_OPT.OBJ/lib/freebl.lib
../../../../../dist/WIN954.0_OPT.OBJ/lib/swfci.lib
../../../../../dist/WIN954.0_OPT.OBJ/lib/secutil.lib
../../../../../dist/WIN954.0_OPT.OBJ/lib/dbm.lib
../../../../../dist/WIN954.0_OPT.OBJ/lib/plc4.lib
../../../../../dist/WIN954.0_OPT.OBJ/lib/plds4.lib
../../../../../dist/WIN954.0_OPT.OBJ/lib/nspr4.lib
wsock32.lib
winmm.lib
WIN954.0_OPT.OBJ/instinit.obj
   Bibliothek WIN954.0_OPT.OBJ/instinit.lib und Objekt 
WIN954.0_OPT.OBJ/instinit.exp wird erstell
instinit.obj : error LNK2001: Nichtaufgeloestes externes Symbol 
_secmod_GetInternalModule
WIN954.0_OPT.OBJ/instinit.exe : fatal error LNK1120: 1 unaufgeloeste externe 
Verweise
gmake[3]: *** [WIN954.0_OPT.OBJ/instinit.exe] Error 2
gmake[3]: Leaving directory 
`C:\mozillasrc\mozilla\security\nss\cmd\swfort\instinit'
gmake[2]: *** [libs] Error 2
gmake[2]: Leaving directory `C:\mozillasrc\mozilla\security\nss\cmd\swfort'
gmake[1]: *** [libs] Error 2
gmake[1]: Leaving directory `C:\mozillasrc\mozilla\security\nss\cmd'

(sorry, it's German)

Am I missing something?

Updated

18 years ago
Assignee: wtc → relyea
Component: Tools → Libraries
Target Milestone: --- → 3.1
Version: 4.0 → 3.1

Comment 1

18 years ago
For a short period of time today, the tree had this
problem.  But we fixed it soon after we noticed it.

Please cvs update your tree and try again.  Let us
know if it's still there.  Thanks.
(Assignee)

Comment 2

18 years ago
Missing file is now checked in. (new version of pk11util.c
Status: UNCONFIRMED → RESOLVED
Last Resolved: 18 years ago
Resolution: --- → FIXED
You need to log in before you can comment on or make changes to this bug.