WinMo configure problem: "checking whether the C compiler (e:/builds/moz2_slave/winmo-electrolysis/electrolysis/objdir/xulrunner/dist/sdk/bin/arm-wince-gcc.exe ) works... no"

RESOLVED FIXED

Status

RESOLVED FIXED
9 years ago
5 years ago

People

(Reporter: cjones, Unassigned)

Tracking

Firefox Tracking Flags

(Not tracked)

Details

http://tinderbox.mozilla.org/showlog.cgi?log=Electrolysis/1263324357.1263324507.22473.gz
s: win32-slave54

checking for e:/builds/moz2_slave/winmo-electrolysis/electrolysis/objdir/xulrunner/dist/sdk/bin/arm-unknown-wince-winmo-gcc.exe... (cached) e:/builds/moz2_slave/winmo-electrolysis/electrolysis/objdir/xulrunner/dist/sdk/bin/arm-wince-gcc.exe
checking for gcc... e:/builds/moz2_slave/winmo-electrolysis/electrolysis/objdir/xulrunner/dist/sdk/bin/arm-wince-gcc.exe
checking whether the C compiler (e:/builds/moz2_slave/winmo-electrolysis/electrolysis/objdir/xulrunner/dist/sdk/bin/arm-wince-gcc.exe  ) works... no
configure: error: installation or configuration problem: C compiler cannot create executables.
*** Fix above errors and then restart with               "make -f client.mk build"
make[2]: Leaving directory `/e/builds/moz2_slave/winmo-electrolysis/electrolysis'
make[1]: Leaving directory `/e/builds/moz2_slave/winmo-electrolysis/electrolysis'
make[2]: *** [configure] Error 1
make[1]: *** [/e/builds/moz2_slave/winmo-electrolysis/electrolysis/objdir/xulrunner/Makefile] Error 2
make: *** [build] Error 2
program finished with exit code 2
elapsedTime=16.579000
=== Output ended ===
======== BuildStep ended ========
There three other builds over the last few days on the same slave that fail in the same way. I think it just missed a clobber when the target changed to arm-wince-winmo, so I've set one.

Please reopen if the problem recurs.
Status: NEW → RESOLVED
Last Resolved: 9 years ago
Resolution: --- → FIXED
(Assignee)

Updated

5 years ago
Product: mozilla.org → Release Engineering
You need to log in before you can comment on or make changes to this bug.