Tinderbox bustage: No rule to make target `png.obj', needed by `png.lib'

RESOLVED FIXED

Status

--
major
RESOLVED FIXED
9 years ago
7 months ago

People

(Reporter: ddahl, Unassigned)

Tracking

1.9.1 Branch
x86
Windows 7

Firefox Tracking Flags

(Not tracked)

Details

(Reporter)

Description

9 years ago
Not sure what is going on here but there is a bustage before the build is finished. 

make[4]: Entering directory `/e/builds/moz2_slave/mozilla-1.9.1-win32-unittest/build/objdir/modules/libimg'
make[5]: Entering directory `/e/builds/moz2_slave/mozilla-1.9.1-win32-unittest/build/objdir/modules/libimg/png'
make[5]: Leaving directory `/e/builds/moz2_slave/mozilla-1.9.1-win32-unittest/build/objdir/modules/libimg/png'
make[4]: Leaving directory `/e/builds/moz2_slave/mozilla-1.9.1-win32-unittest/build/objdir/modules/libimg'
NEXT ERROR make[5]: *** No rule to make target `png.obj', needed by `png.lib'.  Stop.
make[4]: *** [libs] Error 2
make[3]: Leaving directory `/e/builds/moz2_slave/mozilla-1.9.1-win32-unittest/build/objdir'
make[2]: Leaving directory `/e/builds/moz2_slave/mozilla-1.9.1-win32-unittest/build/objdir'
make[1]: Leaving directory `/e/builds/moz2_slave/mozilla-1.9.1-win32-unittest/build/objdir'
make[3]: *** [libs_tier_gecko] Error 2
make[2]: *** [tier_gecko] Error 2
make[1]: *** [default] Error 2
make: *** [build] Error 2
program finished with exit code 2
elapsedTime=367.172000
(Reporter)

Comment 1

9 years ago
http://tinderbox.mozilla.org/showlog.cgi?log=Firefox3.5/1266624298.1266624895.23409.gz

WINNT 5.2 mozilla-1.9.1 unit test [busted] Started 16:04, finished 16:15
This just happened again:
http://tinderbox.mozilla.org/showlog.cgi?log=Firefox3.5/1266802904.1266803283.18010.gz

WINNT 5.2 mozilla-1.9.1 unit test on 2010/02/21 17:41:44
s: win32-slave52
make[5]: *** No rule to make target `png.obj', needed by `png.lib'.  Stop.
So it looks to me that the last three builds for "WINNT 5.2 mozilla-1.9.1 unit test" were all on win32-slave52, and all burned. The first one was a clobber, but the hey, I set another clobber and set it to run again.
Fixed by that clobber, so lets put this down to the build slave getting into a confused state. A genuine build system error would have been hitting all the nightly builds too.

Noticed along the way that the weekly periodic clobbers were not being reported properly, bug 547641 for that.
Status: NEW → RESOLVED
Last Resolved: 9 years ago
Resolution: --- → FIXED

Updated

7 months ago
Product: Core → Firefox Build System
You need to log in before you can comment on or make changes to this bug.