Places branch OS X builds constantly failing

RESOLVED INVALID

Status

Release Engineering
General
RESOLVED INVALID
8 years ago
5 years ago

People

(Reporter: mak, Unassigned)

Tracking

Firefox Tracking Flags

(Not tracked)

Details

(Reporter)

Description

8 years ago
i did a merge today, and os x is failing builds with this error:

make[7]: execvp: /builds/moz2_slave/places-macosx-debug/build/js/src/ctypes/libffi/install-sh: Permission denied
make[7]: *** [src/.dirstamp] Error 127
make[6]: *** [all-recursive] Error 1
make[5]: *** [all] Error 2
make[4]: *** [export] Error 2
make[3]: *** [export_tier_js] Error 2
make[2]: *** [tier_js] Error 2
make[1]: *** [default] Error 2
make: *** [build] Error 2
program finished with exit code 2
There's a problem with the merge - compare the 755 mode on m-c
 http://hg.mozilla.org/mozilla-central/file/tip/js/src/ctypes/libffi/install-sh
with 644 in the places repo
 http://hg.mozilla.org/projects/places/file/tip/js/src/ctypes/libffi/install-sh
Status: NEW → RESOLVED
Last Resolved: 8 years ago
Resolution: --- → INVALID
(Reporter)

Comment 3

8 years ago
uh, we never touched that code, i have no idea how that could have happened
You could try asking Unfocused (Blair McBride) about this, I know he's hit it in the past.
(Reporter)

Comment 5

8 years ago
i just want to note that in my local repository (that i used to push) it has the right mode
-rwxr-xr-x 1 mak Administrators 9231 Apr 21 09:22 install-sh
(Reporter)

Comment 6

8 years ago
i was reading http://mercurial.selenic.com/bts/issue1802
looks like pushing a script with execute rights from Windows does not set it correctly and an extension is needed...
(Assignee)

Updated

5 years ago
Product: mozilla.org → Release Engineering
You need to log in before you can comment on or make changes to this bug.