cross compiling firefox-3.6.3 ,happen a error : "libssl3.so: undefined reference to `CERT_DupDistNames@NSS_3.12.6' "

UNCONFIRMED
Unassigned

Status

()

UNCONFIRMED
8 years ago
5 years ago

People

(Reporter: 363060259, Unassigned)

Tracking

3.6 Branch
Other
Linux
Points:
---

Firefox Tracking Flags

(Not tracked)

Details

(Reporter)

Description

8 years ago
User-Agent:       Mozilla/5.0 (X11; U; Linux i686; zh-CN; rv:1.9.1.9) Gecko/20100401 Ubuntu/9.10 (karmic) Firefox/3.5.9
Build Identifier: Mozilla/5.0 (X11; U; Linux i686; zh-CN; rv:1.9.1.9) Gecko/20100401 Ubuntu/9.10 (karmic) Firefox/3.5.9

when i cross compiling firefox-3.6.3 ,happened a error:
make[4]:正在离开目录 `/home/sns/xorg/system/browser/mozilla-1.9.2/security/nss/cmd/certutil'
make -C ../../security/nss/cmd/pk12util MAKE="make -j1" -j1 CC="arm-none-linux-gnueabi-gcc" SOURCE_MD_DIR=/home/sns/xorg/system/browser/mozilla-1.9.2/dist DIST=/home/sns/xorg/system/browser/mozilla-1.9.2/dist NSPR_INCLUDE_DIR=/home/sns/xorg/system/browser/mozilla-1.9.2/dist/include/nspr NSPR_LIB_DIR=/home/sns/xorg/system/browser/mozilla-1.9.2/dist/lib MOZILLA_CLIENT=1 NO_MDUPDATE=1 NSS_ENABLE_ECC=1 BUILD_OPT=1 OPT_CODE_SIZE=1 NS_USE_GCC=1 NS_USE_NATIVE= FREEBL_NO_DEPEND=1 NSS_ENABLE_ZLIB= PROGRAMS= NSINSTALL="/home/sns/xorg/system/browser/mozilla-1.9.2/config/nsinstall" NATIVE_CC="gcc" CC="arm-none-linux-gnueabi-gcc" CCC="arm-none-linux-gnueabi-g++" LINK="arm-none-linux-gnueabi-ld" AS="arm-none-linux-gnueabi-gcc" AR='arm-none-linux-gnueabi-ar cr $@' RANLIB="arm-none-linux-gnueabi-ranlib" RC=" " OS_ARCH="Linux" OS_TEST="arm" CPU_ARCH="arm" 
make[4]: 正在进入目录 `/home/sns/xorg/system/browser/mozilla-1.9.2/security/nss/cmd/pk12util'
arm-none-linux-gnueabi-gcc -o Linux2.6_arm_glibc_PTH_OPT.OBJ/pk12util -O2 -ansi -D_POSIX_SOURCE -D_BSD_SOURCE -D_XOPEN_SOURCE -fPIC -DLINUX2_1  -Wall -Werror-implicit-function-declaration -Wno-switch -pipe -DLINUX -Dlinux -DHAVE_STRERROR -DXP_UNIX -DNSPR20 -UDEBUG -DNDEBUG -D_REENTRANT -DNSS_ENABLE_ECC -DUSE_UTIL_DIRECTLY -I/home/sns/xorg/system/browser/mozilla-1.9.2/dist/include/nspr -I/home/sns/xorg/system/browser/mozilla-1.9.2/dist/include -I../../../../dist/public/nss  -I../../../../dist/private/nss  -I../../../../dist/include  -I../../../../dist/public/dbm -I../../../../dist/public/seccmd  Linux2.6_arm_glibc_PTH_OPT.OBJ/pk12util.o -lpthread -L/home/sns/xorg/dist/usr/lib -Wl,-rpath=/home/sns/xorg/dist/usr/lib  -Wl,-rpath-link,/home/sns/xorg/system/browser/mozilla-1.9.2/dist/bin -Wl,-rpath-link,/usr/lib   /home/sns/xorg/system/browser/mozilla-1.9.2/dist/lib/libsectool.a  -Wl,-rpath,'$ORIGIN/../lib' -L/home/sns/xorg/system/browser/mozilla-1.9.2/dist/lib -lssl3 -lsmime3 -lnss3 -L/home/sns/xorg/system/browser/mozilla-1.9.2/dist/lib -lnssutil3 -L/home/sns/xorg/system/browser/mozilla-1.9.2/dist/lib -lplc4 -lplds4 -lnspr4  -lpthread  -ldl -lc
/home/sns/xorg/system/browser/mozilla-1.9.2/dist/lib/libssl3.so: undefined reference to `CERT_DupDistNames@NSS_3.12.6'
/home/sns/xorg/system/browser/mozilla-1.9.2/dist/lib/libssl3.so: undefined reference to `CERT_DistNamesFromCertList@NSS_3.12.6'
collect2: ld returned 1 exit status
make[4]: *** [Linux2.6_arm_glibc_PTH_OPT.OBJ/pk12util] 错误 1
make[4]:正在离开目录 `/home/sns/xorg/system/browser/mozilla-1.9.2/security/nss/cmd/pk12util'
make[3]: *** [libs] 错误 2
make[3]:正在离开目录 `/home/sns/xorg/system/browser/mozilla-1.9.2/security/manager'
make[2]: *** [libs_tier_toolkit] 错误 2
make[2]:正在离开目录 `/home/sns/xorg/system/browser/mozilla-1.9.2'
make[1]: *** [tier_toolkit] 错误 2
make[1]:正在离开目录 `/home/sns/xorg/system/browser/mozilla-1.9.2'
make: *** [default] 错误 2


Reproducible: Always

Comment 1

8 years ago
That's not at all detailed. I think you should provide at least the build configuration you use.
Assignee: nobody → nobody
Component: Security → Build
Product: Firefox → NSS
QA Contact: firefox → build
Sorry, there's no evidence in this bug of any failure of any NSS build system.
Assignee: nobody → nobody
Component: Build → Build Config
Product: NSS → Firefox
QA Contact: build → build.config
Version: unspecified → 3.6 Branch

Comment 3

5 years ago
I'm pretty sure this can be RESOLVED OBSOLETE, or the equivalent over here.
You need to log in before you can comment on or make changes to this bug.