Closed Bug 694485 Opened 14 years ago Closed 7 years ago

compilation failure with android r6 ndk

Categories

(Tamarin Graveyard :: Virtual Machine, defect)

ARM
Android
defect
Not set
normal

Tracking

(Not tracked)

RESOLVED WONTFIX

People

(Reporter: trbaker, Unassigned)

References

Details

Attachments

(1 file)

Attached file build log —
error with linux android ndk: compiler version: arm-linux-androideabi-g++ (GCC) 4.4.3 true "Preprocessing core/Traits" true "Compiling core/Traits" cc1plus: warnings being treated as errors ../core/Traits.cpp: In member function 'uint32_t avmplus::Traits::finishSlotsAndMethods(const avmplus::TraitsBindings*, avmplus::TraitsBindings*, const avmplus::Toplevel*, const avmplus::Traits::SlotSizeInfo&) const': ../core/Traits.cpp:675: error: 'ne.avmplus::NameEntry::id' may be used uninitialized in this function ../core/Traits.cpp:1101: note: 'ne.avmplus::NameEntry::id' was declared here ../core/Traits.cpp:675: error: 'sic.avmplus::SlotIdCalcer::m_slotCount' may be used uninitialized in this function ../core/Traits.cpp:1038: note: 'sic.avmplus::SlotIdCalcer::m_slotCount' was declared here ../core/Traits.cpp:1131: error: 'ne.avmplus::NameEntry::info' may be used uninitialized in this function ../core/Traits.cpp:1101: note: 'ne.avmplus::NameEntry::info' was declared here make: *** [core/Traits.o] Error 1 build failed return value 2
Flags: flashplayer-qrb?
See Also: → 693963
Summary: compilation failure with android r6 ndk on linux → compilation failure with android r6 ndk
Is this still an issue? The "see also: bug 693963 has been fixed.
Tamarin is a dead project now. Mass WONTFIX.
Status: NEW → RESOLVED
Closed: 7 years ago
Resolution: --- → WONTFIX
Tamarin isn't maintained anymore. WONTFIX remaining bugs.
You need to log in before you can comment on or make changes to this bug.

Attachment

General

Creator:
Created:
Updated:
Size: