unable to build unless I have a --disable-elf-hack in my mozconfig

RESOLVED WORKSFORME

Status

()

Firefox for Android
General
P4
normal
RESOLVED WORKSFORME
6 years ago
6 years ago

People

(Reporter: jmaher, Assigned: glandium)

Tracking

Firefox Tracking Flags

(Not tracked)

Details

(Reporter)

Description

6 years ago
DMOZ_GFX_OPTIMIZE_MOBILE=1 -DMOZ_DEBUG_SYMBOLS=1 -DMOZ_LOGGING=1 -DSIZEOF_INT_P=4 -DMOZ_MEMORY_SIZEOF_PTR_2POW=2 -DMOZ_MEMORY=1 -DMOZ_MEMORY_LINUX=1 -DMOZ_MEMORY_ANDROID=1 -DHAVE_JEMALLOC_VALLOC=1 -DHAVE_JEMALLOC_POSIX_MEMALIGN=1 -DHAVE_JEMALLOC_MEMALIGN=1 -DJSGC_INCREMENTAL=1 -DHAVE__UNWIND_BACKTRACE=1 -DJS_DEFAULT_JITREPORT_GRANULARITY=3 -DMOZ_OMNIJAR=1 -DMOZ_USER_DIR=\".mozilla\" -DMOZ_STATIC_JS=1 -DHAVE_STDINT_H=1 -DHAVE_INTTYPES_H=1 -DMOZ_TREE_CAIRO=1 -DHAVE_UINT64_T=1 -DMOZ_TREE_PIXMAN=1 -DMOZ_ENABLE_SKIA=1 -DMOZ_XUL=1 -DMOZ_PROFILELOCKING=1 -DBUILD_CTYPES=1 -DMOZ_PLACES=1 -DMOZ_SERVICES_SYNC=1 -DMOZ_APP_COMPONENT_INCLUDE=\"nsBrowserComponents.h\" -DMOZ_APP_UA_NAME=\"\" -DMOZ_APP_UA_VERSION=\"11.0a1\" -DMOZ_UA_FIREFOX_VERSION=\"11.0a1\" -DFIREFOX_VERSION=11.0a1 -DMOZ_UA_BUILDID=\"\" -DMOZ_DLL_SUFFIX=\".so\" -DXP_UNIX=1 -DUNIX_ASYNC_DNS=1  > removed-files
===
=== If you get failures below, please file a bug describing the error
=== and your environment (compiler and linker versions), and use
=== --disable-elf-hack until this is fixed.
===
cd ../../../dist/bin; find . -name "*.so" | xargs ../../build/unix/elfhack/elfhack
./libmozsqlite3.so: Reduced by 3980 bytes
./libmozutils.so: No gain. Skipping
./libnss3.so: No gain. Skipping
./plugins/libnptest.so: Reduced by 8076 bytes
./libssl3.so: No gain. Skipping
./libsmime3.so: No gain. Skipping
./lib/libplugin-container.so: xargs: ../../build/unix/elfhack/elfhack: terminated by signal 11
make[2]: *** [elfhack] Error 125
make[2]: Leaving directory `/home/jmaher/mozilla/src/objdir-droid/mobile/android/installer'
make[1]: *** [default] Error 2
make[1]: Leaving directory `/home/jmaher/mozilla/src/objdir-droid/mobile/android/installer'
make: *** [package] Error 2
jmaher@jmaher-MacBookPro:~/mozilla/src/objdir-droid$
(Assignee)

Comment 1

6 years ago
Can you attach the libplugin-container.so file you get during the build?
Assignee: nobody → mh+mozilla
Priority: -- → P4
(Assignee)

Comment 2

6 years ago
Joel, ping?
(Reporter)

Comment 3

6 years ago
I don't seem to have this problem anymore
(Assignee)

Updated

6 years ago
Status: NEW → RESOLVED
Last Resolved: 6 years ago
Resolution: --- → WORKSFORME
You need to log in before you can comment on or make changes to this bug.