Closed
Bug 738992
Opened 14 years ago
Closed 13 years ago
Intermittent netwerk/test/browser/browser_NetUtil.js | request succeeded and a time out
*
Summary:
Intermittent netwerk/test/browser/browser_NetUtil.js | request succeeded and a time out
Categories
(Core :: Networking, defect)
Tracking
()
RESOLVED
WORKSFORME
RESOLVED
WORKSFORME
---
Iteration:
---
| a11y-review | |
| Accessibility Severity | |
| Performance Impact | |
| Size Estimate | |
| Webcompat Priority | |
| Webcompat Score |
| Tracking | Status | |
|---|---|---|
| relnote-firefox | ||
| thunderbird_esr115 | ||
| thunderbird_esr153 | ||
| firefox-esr115 | ||
| firefox-esr153 | ||
| firefox158 | ||
| firefox159 | ||
| firefox160 |
People
(Reporter: RyanVM, Unassigned)
References
Details
(Keywords: intermittent-failure)
---
---
QA Whiteboard:
---
Has STR:
---
Change Request:
---
0
Bug Flags:
|
| ||||
Crash Data
Signature:
None
Security
(public)
This bug is publicly visible.
User Story
https://tbpl.mozilla.org/php/getParsedLog.php?id=10350770&tree=Mozilla-Inbound&full=1
Rev3 Fedora 12x64 mozilla-inbound pgo test mochitest-other on 2012-03-24 12:44:43 PDT for push 2342271b2be1
builder: mozilla-inbound_fedora64_test_pgo-mochitest-other
slave: talos-r3-fed64-058
starttime: 1332618283.38
results: warnings (1)
buildid: 20120324090002
builduid: 1c4b010ed08a44fc806fa902dabbabb3
revision: 2342271b2be1
TEST-START | chrome://mochitests/content/browser/netwerk/test/browser/browser_NetUtil.js
TEST-PASS | chrome://mochitests/content/browser/netwerk/test/browser/browser_NetUtil.js | request failed
TEST-PASS | chrome://mochitests/content/browser/netwerk/test/browser/browser_NetUtil.js | request is an nsIHttpChannel
TEST-PASS | chrome://mochitests/content/browser/netwerk/test/browser/browser_NetUtil.js | cert error dialog was not shown
TEST-PASS | chrome://mochitests/content/browser/netwerk/test/browser/browser_NetUtil.js | request failed
TEST-PASS | chrome://mochitests/content/browser/netwerk/test/browser/browser_NetUtil.js | request is an nsIHttpChannel
TEST-PASS | chrome://mochitests/content/browser/netwerk/test/browser/browser_NetUtil.js | cert error dialog was not shown
TEST-UNEXPECTED-FAIL | chrome://mochitests/content/browser/netwerk/test/browser/browser_NetUtil.js | request succeeded
Stack trace:
JS frame :: chrome://mochitests/content/browser/netwerk/test/browser/browser_NetUtil.js :: <TOP_LEVEL> :: line 64
JS frame :: resource://gre/modules/NetUtil.jsm :: <TOP_LEVEL> :: line 174
TEST-PASS | chrome://mochitests/content/browser/netwerk/test/browser/browser_NetUtil.js | request is an nsIHttpChannel
TEST-INFO | chrome://mochitests/content/browser/netwerk/test/browser/browser_NetUtil.js | Console message: [JavaScript Error: "[Exception... "Component returned failure code: 0x80040111 (NS_ERROR_NOT_AVAILABLE) [nsIHttpChannel.requestSucceeded]" nsresult: "0x80040111 (NS_ERROR_NOT_AVAILABLE)" location: "JS frame :: chrome://mochitests/content/browser/netwerk/test/browser/browser_NetUtil.js :: <TOP_LEVEL> :: line 66" data: no]" {file: "chrome://mochitests/content/browser/netwerk/test/browser/browser_NetUtil.js" line: 66}]
TEST-UNEXPECTED-FAIL | chrome://mochitests/content/browser/netwerk/test/browser/browser_NetUtil.js | Test timed out
Comment 1•14 years ago
|
||
| Comment hidden (Legacy TBPL/Treeherder Robot) |
mbrubeck
https://tbpl.mozilla.org/php/getParsedLog.php?id=10383273&tree=Mozilla-Inbound
Rev3 Fedora 12x64 mozilla-inbound opt test mochitest-other on 2012-03-26 14:58:13
TEST-UNEXPECTED-FAIL | chrome://mochitests/content/browser/netwerk/test/browser/browser_NetUtil.js | request succeeded
TEST-UNEXPECTED-FAIL | chrome://mochitests/content/browser/netwerk/test/browser/browser_NetUtil.js | Test timed out
Comment 2•14 years ago
|
||
| Comment hidden (Legacy TBPL/Treeherder Robot) |
philor
https://tbpl.mozilla.org/php/getParsedLog.php?id=10383273&tree=Mozilla-Inbound
Rev3 Fedora 12x64 mozilla-inbound opt test mochitest-other on 2012-03-26 14:58:13
TEST-UNEXPECTED-FAIL | chrome://mochitests/content/browser/netwerk/test/browser/browser_NetUtil.js | request succeeded
TEST-UNEXPECTED-FAIL | chrome://mochitests/content/browser/netwerk/test/browser/browser_NetUtil.js | Test timed out
Comment 3•14 years ago
|
||
| Comment hidden (Legacy TBPL/Treeherder Robot) |
philor
https://tbpl.mozilla.org/php/getParsedLog.php?id=10381461&tree=Profiling
Rev3 WINNT 5.1 profiling opt test mochitest-other on 2012-03-26 14:00:28
TEST-UNEXPECTED-FAIL | chrome://mochitests/content/browser/netwerk/test/browser/browser_NetUtil.js | request succeeded
TEST-UNEXPECTED-FAIL | chrome://mochitests/content/browser/netwerk/test/browser/browser_NetUtil.js | Test timed out
Comment 4•14 years ago
|
||
| Comment hidden (Legacy TBPL/Treeherder Robot) |
mak77%bonardo.net
https://tbpl.mozilla.org/php/getParsedLog.php?id=10853452&tree=Mozilla-Inbound
Rev3 Fedora 12x64 mozilla-inbound opt test mochitest-other on 2012-04-12 14:55:55
TEST-UNEXPECTED-FAIL | chrome://mochitests/content/browser/netwerk/test/browser/browser_NetUtil.js | request succeeded
TEST-UNEXPECTED-FAIL | chrome://mochitests/content/browser/netwerk/test/browser/browser_NetUtil.js | Test timed out
Comment 5•14 years ago
|
||
| Comment hidden (Legacy TBPL/Treeherder Robot) |
philor
https://tbpl.mozilla.org/php/getParsedLog.php?id=11113053&tree=Profiling
Rev3 Fedora 12x64 profiling opt test mochitest-other on 2012-04-22 16:16:01
slave: talos-r3-fed64-009
TEST-UNEXPECTED-FAIL | chrome://mochitests/content/browser/netwerk/test/browser/browser_NetUtil.js | request succeeded
TEST-UNEXPECTED-FAIL | chrome://mochitests/content/browser/netwerk/test/browser/browser_NetUtil.js | Test timed out
Comment 6•14 years ago
|
||
| Comment hidden (Legacy TBPL/Treeherder Robot) |
edmorley
https://tbpl.mozilla.org/php/getParsedLog.php?id=11146425&tree=Birch
Rev3 Fedora 12x64 birch opt test mochitest-other on 2012-04-23 23:29:52
slave: talos-r3-fed64-017
TEST-UNEXPECTED-FAIL | chrome://mochitests/content/browser/netwerk/test/browser/browser_NetUtil.js | request succeeded
TEST-UNEXPECTED-FAIL | chrome://mochitests/content/browser/netwerk/test/browser/browser_NetUtil.js | Test timed out
Comment 7•14 years ago
|
||
| Comment hidden (Legacy TBPL/Treeherder Robot) |
edmorley
https://tbpl.mozilla.org/php/getParsedLog.php?id=11156268&tree=Mozilla-Inbound
Rev3 Fedora 12x64 mozilla-inbound opt test mochitest-other on 2012-04-24 07:48:26
slave: talos-r3-fed64-060
TEST-UNEXPECTED-FAIL | chrome://mochitests/content/browser/netwerk/test/browser/browser_NetUtil.js | request succeeded
TEST-UNEXPECTED-FAIL | chrome://mochitests/content/browser/netwerk/test/browser/browser_NetUtil.js | Test timed out
Comment 8•14 years ago
|
||
| Comment hidden (Legacy TBPL/Treeherder Robot) |
philor
https://tbpl.mozilla.org/php/getParsedLog.php?id=11175798&tree=Mozilla-Aurora
Rev3 Fedora 12x64 mozilla-aurora pgo test mochitest-other on 2012-04-24 17:22:26
slave: talos-r3-fed64-068
TEST-UNEXPECTED-FAIL | chrome://mochitests/content/browser/netwerk/test/browser/browser_NetUtil.js | request succeeded
TEST-UNEXPECTED-FAIL | chrome://mochitests/content/browser/netwerk/test/browser/browser_NetUtil.js | Test timed out
Comment 9•14 years ago
|
||
| Comment hidden (Legacy TBPL/Treeherder Robot) |
graememcc_firefox%graeme-online.co.uk
https://tbpl.mozilla.org/php/getParsedLog.php?id=11187918&tree=Mozilla-Inbound
Rev3 Fedora 12x64 mozilla-inbound opt test mochitest-other on 2012-04-25 00:40:48
slave: talos-r3-fed64-017
TEST-UNEXPECTED-FAIL | chrome://mochitests/content/browser/netwerk/test/browser/browser_NetUtil.js | request succeeded
TEST-UNEXPECTED-FAIL | chrome://mochitests/content/browser/netwerk/test/browser/browser_NetUtil.js | Test timed out
Comment 10•14 years ago
|
||
| Comment hidden (Legacy TBPL/Treeherder Robot) |
edmorley
https://tbpl.mozilla.org/php/getParsedLog.php?id=11224398&tree=Firefox
Rev3 Fedora 12x64 mozilla-central pgo test mochitest-other on 2012-04-26 04:03:54
slave: talos-r3-fed64-046
TEST-UNEXPECTED-FAIL | chrome://mochitests/content/browser/netwerk/test/browser/browser_NetUtil.js | request succeeded
TEST-UNEXPECTED-FAIL | chrome://mochitests/content/browser/netwerk/test/browser/browser_NetUtil.js | Test timed out
Comment 11•14 years ago
|
||
| Comment hidden (Legacy TBPL/Treeherder Robot) |
jwein%mozilla.com
https://tbpl.mozilla.org/php/getParsedLog.php?id=11295095&tree=Mozilla-Inbound
Rev3 Fedora 12x64 mozilla-inbound pgo test mochitest-other on 2012-04-28 09:57:17
slave: talos-r3-fed64-017
TEST-UNEXPECTED-FAIL | chrome://mochitests/content/browser/netwerk/test/browser/browser_NetUtil.js | request succeeded
TEST-UNEXPECTED-FAIL | chrome://mochitests/content/browser/netwerk/test/browser/browser_NetUtil.js | Test timed out
Comment 12•14 years ago
|
||
| Comment hidden (Legacy TBPL/Treeherder Robot) |
edmorley
https://tbpl.mozilla.org/php/getParsedLog.php?id=11321305&tree=Mozilla-Inbound
Rev3 Fedora 12x64 mozilla-inbound opt test mochitest-other on 2012-04-30 04:01:07
slave: talos-r3-fed64-024
TEST-UNEXPECTED-FAIL | chrome://mochitests/content/browser/netwerk/test/browser/browser_NetUtil.js | request succeeded
TEST-UNEXPECTED-FAIL | chrome://mochitests/content/browser/netwerk/test/browser/browser_NetUtil.js | Test timed out
Comment 13•14 years ago
|
||
| Comment hidden (Legacy TBPL/Treeherder Robot) |
jimb
https://tbpl.mozilla.org/php/getParsedLog.php?id=11242476&tree=Try
Rev3 Fedora 12x64 try opt test mochitest-other on 2012-04-26 13:38:00
slave: talos-r3-fed64-004
TEST-UNEXPECTED-FAIL | chrome://mochitests/content/browser/netwerk/test/browser/browser_NetUtil.js | request succeeded
TEST-UNEXPECTED-FAIL | chrome://mochitests/content/browser/netwerk/test/browser/browser_NetUtil.js | Test timed out
Comment 14•14 years ago
|
||
| Comment hidden (Legacy TBPL/Treeherder Robot) |
philor
https://tbpl.mozilla.org/php/getParsedLog.php?id=11391717&tree=Mozilla-Inbound
Rev3 Fedora 12x64 mozilla-inbound pgo test mochitest-other on 2012-05-02 08:43:34
slave: talos-r3-fed64-071
TEST-UNEXPECTED-FAIL | chrome://mochitests/content/browser/netwerk/test/browser/browser_NetUtil.js | request succeeded
TEST-UNEXPECTED-FAIL | chrome://mochitests/content/browser/netwerk/test/browser/browser_NetUtil.js | Test timed out
Comment 15•14 years ago
|
||
| Comment hidden (Legacy TBPL/Treeherder Robot) |
edmorley
https://tbpl.mozilla.org/php/getParsedLog.php?id=11428729&tree=Fx-Team
Rev3 Fedora 12x64 fx-team pgo test mochitest-other on 2012-05-03 07:25:26
slave: talos-r3-fed64-068
TEST-UNEXPECTED-FAIL | chrome://mochitests/content/browser/netwerk/test/browser/browser_NetUtil.js | request succeeded
TEST-UNEXPECTED-FAIL | chrome://mochitests/content/browser/netwerk/test/browser/browser_NetUtil.js | Test timed out
Comment 16•14 years ago
|
||
| Comment hidden (Legacy TBPL/Treeherder Robot) |
dkeeler
https://tbpl.mozilla.org/php/getParsedLog.php?id=11406262&tree=Try
Rev3 WINNT 5.1 try opt test mochitest-other on 2012-05-02 16:53:51
slave: talos-r3-xp-042
TEST-UNEXPECTED-FAIL | chrome://mochitests/content/browser/netwerk/test/browser/browser_NetUtil.js | request succeeded
TEST-UNEXPECTED-FAIL | chrome://mochitests/content/browser/netwerk/test/browser/browser_NetUtil.js | Test timed out
Comment 17•14 years ago
|
||
| Comment hidden (Legacy TBPL/Treeherder Robot) |
ryanvm%gmail.com
https://tbpl.mozilla.org/php/getParsedLog.php?id=11501541&tree=Mozilla-Inbound
Rev3 Fedora 12x64 mozilla-inbound pgo test mochitest-other on 2012-05-05 10:05:03
slave: talos-r3-fed64-061
TEST-UNEXPECTED-FAIL | chrome://mochitests/content/browser/netwerk/test/browser/browser_NetUtil.js | request succeeded
TEST-UNEXPECTED-FAIL | chrome://mochitests/content/browser/netwerk/test/browser/browser_NetUtil.js | Test timed out
Comment 18•14 years ago
|
||
| Comment hidden (Legacy TBPL/Treeherder Robot) |
vporof
https://tbpl.mozilla.org/php/getParsedLog.php?id=11542046&tree=Fx-Team
Rev3 Fedora 12x64 fx-team pgo test mochitest-other on 2012-05-07 13:43:20
slave: talos-r3-fed64-065
TEST-UNEXPECTED-FAIL | chrome://mochitests/content/browser/netwerk/test/browser/browser_NetUtil.js | request succeeded
TEST-UNEXPECTED-FAIL | chrome://mochitests/content/browser/netwerk/test/browser/browser_NetUtil.js | Test timed out
Comment 19•14 years ago
|
||
| Comment hidden (Legacy TBPL/Treeherder Robot) |
edmorley
https://tbpl.mozilla.org/php/getParsedLog.php?id=11564636&tree=Mozilla-Inbound
Rev3 Fedora 12x64 mozilla-inbound opt test mochitest-other on 2012-05-08 04:10:29
slave: talos-r3-fed64-069
TEST-UNEXPECTED-FAIL | chrome://mochitests/content/browser/netwerk/test/browser/browser_NetUtil.js | request succeeded
TEST-UNEXPECTED-FAIL | chrome://mochitests/content/browser/netwerk/test/browser/browser_NetUtil.js | Test timed out
Comment 20•14 years ago
|
||
| Comment hidden (Legacy TBPL/Treeherder Robot) |
philor
https://tbpl.mozilla.org/php/getParsedLog.php?id=11569773&tree=Firefox
Rev3 Fedora 12x64 mozilla-central pgo test mochitest-other on 2012-05-08 06:56:20
slave: talos-r3-fed64-023
TEST-UNEXPECTED-FAIL | chrome://mochitests/content/browser/netwerk/test/browser/browser_NetUtil.js | request succeeded
TEST-UNEXPECTED-FAIL | chrome://mochitests/content/browser/netwerk/test/browser/browser_NetUtil.js | Test timed out
Comment 21•14 years ago
|
||
| Comment hidden (Legacy TBPL/Treeherder Robot) |
edmorley
https://tbpl.mozilla.org/php/getParsedLog.php?id=11569773&tree=Firefox
Rev3 Fedora 12x64 mozilla-central pgo test mochitest-other on 2012-05-08 06:56:20
slave: talos-r3-fed64-023
TEST-UNEXPECTED-FAIL | chrome://mochitests/content/browser/netwerk/test/browser/browser_NetUtil.js | request succeeded
TEST-UNEXPECTED-FAIL | chrome://mochitests/content/browser/netwerk/test/browser/browser_NetUtil.js | Test timed out
Comment 22•14 years ago
|
||
Evidently the "valid request" is failing for some reason... I added some logging to determine with what nsresult:
https://hg.mozilla.org/integration/mozilla-inbound/rev/69b20b2d47f1
Comment 23•14 years ago
|
||
| Comment hidden (Legacy TBPL/Treeherder Robot) |
jbuck
https://tbpl.mozilla.org/php/getParsedLog.php?id=11576821&tree=Mozilla-Inbound
Rev3 Fedora 12x64 mozilla-inbound opt test mochitest-other on 2012-05-08 11:25:23
slave: talos-r3-fed64-032
TEST-UNEXPECTED-FAIL | chrome://mochitests/content/browser/netwerk/test/browser/browser_NetUtil.js | request succeeded
TEST-UNEXPECTED-FAIL | chrome://mochitests/content/browser/netwerk/test/browser/browser_NetUtil.js | Test timed out
Comment 24•14 years ago
|
||
| Comment hidden (Legacy TBPL/Treeherder Robot) |
froydnj
https://tbpl.mozilla.org/php/getParsedLog.php?id=11573655&tree=Try
Rev3 Fedora 12x64 try opt test mochitest-other on 2012-05-08 09:21:13
slave: talos-r3-fed64-066
TEST-UNEXPECTED-FAIL | chrome://mochitests/content/browser/netwerk/test/browser/browser_NetUtil.js | request succeeded
TEST-UNEXPECTED-FAIL | chrome://mochitests/content/browser/netwerk/test/browser/browser_NetUtil.js | Test timed out
Comment 25•14 years ago
|
||
| Comment hidden (Legacy TBPL/Treeherder Robot) |
philor
https://tbpl.mozilla.org/php/getParsedLog.php?id=11577794&tree=Mozilla-Aurora
Rev3 Fedora 12x64 mozilla-aurora pgo test mochitest-other on 2012-05-08 12:00:26
slave: talos-r3-fed64-052
TEST-UNEXPECTED-FAIL | chrome://mochitests/content/browser/netwerk/test/browser/browser_NetUtil.js | request succeeded
TEST-UNEXPECTED-FAIL | chrome://mochitests/content/browser/netwerk/test/browser/browser_NetUtil.js | Test timed out
Comment 26•14 years ago
|
||
| Comment hidden (Legacy TBPL/Treeherder Robot) |
philor
https://tbpl.mozilla.org/php/getParsedLog.php?id=11581532&tree=Services-Central
Rev3 Fedora 12x64 services-central pgo test mochitest-other on 2012-05-08 13:57:22
slave: talos-r3-fed64-052
TEST-UNEXPECTED-FAIL | chrome://mochitests/content/browser/netwerk/test/browser/browser_NetUtil.js | request succeeded
TEST-UNEXPECTED-FAIL | chrome://mochitests/content/browser/netwerk/test/browser/browser_NetUtil.js | Test timed out
| Reporter | ||
Comment 27•14 years ago
|
||
Comment 28•14 years ago
|
||
| Comment hidden (Legacy TBPL/Treeherder Robot) |
edmorley
https://tbpl.mozilla.org/php/getParsedLog.php?id=11598263&tree=Mozilla-Inbound
Rev3 Fedora 12x64 mozilla-inbound pgo test mochitest-other on 2012-05-09 01:12:23
slave: talos-r3-fed64-048
TEST-UNEXPECTED-FAIL | chrome://mochitests/content/browser/netwerk/test/browser/browser_NetUtil.js | request succeeded
TEST-UNEXPECTED-FAIL | chrome://mochitests/content/browser/netwerk/test/browser/browser_NetUtil.js | Test timed out
Comment 29•14 years ago
|
||
| Comment hidden (Legacy TBPL/Treeherder Robot) |
edmorley
https://tbpl.mozilla.org/php/getParsedLog.php?id=11606032&tree=Mozilla-Inbound
Rev3 Fedora 12x64 mozilla-inbound pgo test mochitest-other on 2012-05-09 06:50:16
slave: talos-r3-fed64-037
TEST-UNEXPECTED-FAIL | chrome://mochitests/content/browser/netwerk/test/browser/browser_NetUtil.js | request succeeded
TEST-UNEXPECTED-FAIL | chrome://mochitests/content/browser/netwerk/test/browser/browser_NetUtil.js | Test timed out
Comment 30•14 years ago
|
||
| Comment hidden (Legacy TBPL/Treeherder Robot) |
philor
https://tbpl.mozilla.org/php/getParsedLog.php?id=11608506&tree=Mozilla-Inbound
Rev3 Fedora 12x64 mozilla-inbound opt test mochitest-other on 2012-05-09 08:21:19
slave: talos-r3-fed64-066
TEST-UNEXPECTED-FAIL | chrome://mochitests/content/browser/netwerk/test/browser/browser_NetUtil.js | request succeeded
TEST-UNEXPECTED-FAIL | chrome://mochitests/content/browser/netwerk/test/browser/browser_NetUtil.js | Test timed out
Comment 31•14 years ago
|
||
So the latest logs show the request is failing with NS_ERROR_NET_RESET. bsmith, do you know why this might be happening in our test environment, or what could cause this to happen in general?
Comment 32•14 years ago
|
||
Patrick may have some ideas re: comment 31 too.
Comment 33•14 years ago
|
||
| Comment hidden (Legacy TBPL/Treeherder Robot) |
philor
https://tbpl.mozilla.org/php/getParsedLog.php?id=11613138&tree=Mozilla-Inbound
Rev3 Fedora 12x64 mozilla-inbound opt test mochitest-other on 2012-05-09 11:08:30
slave: talos-r3-fed64-034
TEST-UNEXPECTED-FAIL | chrome://mochitests/content/browser/netwerk/test/browser/browser_NetUtil.js | request succeeded
TEST-UNEXPECTED-FAIL | chrome://mochitests/content/browser/netwerk/test/browser/browser_NetUtil.js | Test timed out
Comment 34•14 years ago
|
||
| Comment hidden (Legacy TBPL/Treeherder Robot) |
philor
https://tbpl.mozilla.org/php/getParsedLog.php?id=11618227&tree=Firefox
Rev3 Fedora 12x64 mozilla-central opt test mochitest-other on 2012-05-09 14:07:02
slave: talos-r3-fed64-017
TEST-UNEXPECTED-FAIL | chrome://mochitests/content/browser/netwerk/test/browser/browser_NetUtil.js | request succeeded
TEST-UNEXPECTED-FAIL | chrome://mochitests/content/browser/netwerk/test/browser/browser_NetUtil.js | Test timed out
Comment 35•14 years ago
|
||
| Comment hidden (Legacy TBPL/Treeherder Robot) |
ryanvm%gmail.com
https://tbpl.mozilla.org/php/getParsedLog.php?id=11619285&tree=Firefox
Rev3 Fedora 12x64 mozilla-central opt test mochitest-other on 2012-05-09 14:41:08
slave: talos-r3-fed64-037
TEST-UNEXPECTED-FAIL | chrome://mochitests/content/browser/netwerk/test/browser/browser_NetUtil.js | request succeeded
TEST-UNEXPECTED-FAIL | chrome://mochitests/content/browser/netwerk/test/browser/browser_NetUtil.js | Test timed out
Comment 36•14 years ago
|
||
| Comment hidden (Legacy TBPL/Treeherder Robot) |
philor
https://tbpl.mozilla.org/php/getParsedLog.php?id=11628508&tree=Mozilla-Inbound
Rev3 Fedora 12x64 mozilla-inbound pgo test mochitest-other on 2012-05-09 19:33:09
slave: talos-r3-fed64-068
TEST-UNEXPECTED-FAIL | chrome://mochitests/content/browser/netwerk/test/browser/browser_NetUtil.js | request succeeded
TEST-UNEXPECTED-FAIL | chrome://mochitests/content/browser/netwerk/test/browser/browser_NetUtil.js | Test timed out
Comment 37•14 years ago
|
||
| Comment hidden (Legacy TBPL/Treeherder Robot) |
peterv
https://tbpl.mozilla.org/php/getParsedLog.php?id=11639766&tree=Mozilla-Inbound
Rev3 Fedora 12x64 mozilla-inbound pgo test mochitest-other on 2012-05-10 04:24:22
slave: talos-r3-fed64-045
TEST-UNEXPECTED-FAIL | chrome://mochitests/content/browser/netwerk/test/browser/browser_NetUtil.js | request succeeded
TEST-UNEXPECTED-FAIL | chrome://mochitests/content/browser/netwerk/test/browser/browser_NetUtil.js | Test timed out
Comment 38•14 years ago
|
||
| Comment hidden (Legacy TBPL/Treeherder Robot) |
edmorley
https://tbpl.mozilla.org/php/getParsedLog.php?id=11639766&tree=Mozilla-Inbound
Rev3 Fedora 12x64 mozilla-inbound pgo test mochitest-other on 2012-05-10 04:24:22
slave: talos-r3-fed64-045
TEST-UNEXPECTED-FAIL | chrome://mochitests/content/browser/netwerk/test/browser/browser_NetUtil.js | request succeeded
TEST-UNEXPECTED-FAIL | chrome://mochitests/content/browser/netwerk/test/browser/browser_NetUtil.js | Test timed out
Comment 39•14 years ago
|
||
| Comment hidden (Legacy TBPL/Treeherder Robot) |
edmorley
https://tbpl.mozilla.org/php/getParsedLog.php?id=11640825&tree=Fx-Team
Rev3 Fedora 12x64 fx-team pgo test mochitest-other on 2012-05-10 05:02:20
slave: talos-r3-fed64-021
TEST-UNEXPECTED-FAIL | chrome://mochitests/content/browser/netwerk/test/browser/browser_NetUtil.js | request succeeded
TEST-UNEXPECTED-FAIL | chrome://mochitests/content/browser/netwerk/test/browser/browser_NetUtil.js | Test timed out
Comment 40•14 years ago
|
||
| Comment hidden (Legacy TBPL/Treeherder Robot) |
philor
https://tbpl.mozilla.org/php/getParsedLog.php?id=11647547&tree=Mozilla-Inbound
Rev3 Fedora 12x64 mozilla-inbound pgo test mochitest-other on 2012-05-10 09:57:22
slave: talos-r3-fed64-013
TEST-UNEXPECTED-FAIL | chrome://mochitests/content/browser/netwerk/test/browser/browser_NetUtil.js | request succeeded
TEST-UNEXPECTED-FAIL | chrome://mochitests/content/browser/netwerk/test/browser/browser_NetUtil.js | Test timed out
Comment 41•14 years ago
|
||
| Comment hidden (Legacy TBPL/Treeherder Robot) |
edmorley
https://tbpl.mozilla.org/php/getParsedLog.php?id=11647547&tree=Mozilla-Inbound
Rev3 Fedora 12x64 mozilla-inbound pgo test mochitest-other on 2012-05-10 09:57:22
slave: talos-r3-fed64-013
TEST-UNEXPECTED-FAIL | chrome://mochitests/content/browser/netwerk/test/browser/browser_NetUtil.js | request succeeded
TEST-UNEXPECTED-FAIL | chrome://mochitests/content/browser/netwerk/test/browser/browser_NetUtil.js | Test timed out
Comment 42•14 years ago
|
||
| Comment hidden (Legacy TBPL/Treeherder Robot) |
philor
https://tbpl.mozilla.org/php/getParsedLog.php?id=11658865&tree=Mozilla-Inbound
Rev3 Fedora 12x64 mozilla-inbound pgo test mochitest-other on 2012-05-10 16:01:05
slave: talos-r3-fed64-057
TEST-UNEXPECTED-FAIL | chrome://mochitests/content/browser/netwerk/test/browser/browser_NetUtil.js | request succeeded
TEST-UNEXPECTED-FAIL | chrome://mochitests/content/browser/netwerk/test/browser/browser_NetUtil.js | Test timed out
Comment 43•14 years ago
|
||
| Comment hidden (Legacy TBPL/Treeherder Robot) |
bbondy
https://tbpl.mozilla.org/php/getParsedLog.php?id=11654071&tree=Try
Rev3 Fedora 12x64 try opt test mochitest-other on 2012-05-10 13:24:00
slave: talos-r3-fed64-051
TEST-UNEXPECTED-FAIL | chrome://mochitests/content/browser/netwerk/test/browser/browser_NetUtil.js | request succeeded
TEST-UNEXPECTED-FAIL | chrome://mochitests/content/browser/netwerk/test/browser/browser_NetUtil.js | Test timed out
Comment 44•14 years ago
|
||
| Comment hidden (Legacy TBPL/Treeherder Robot) |
philor
https://tbpl.mozilla.org/php/getParsedLog.php?id=11663796&tree=Mozilla-Inbound
Rev3 Fedora 12x64 mozilla-inbound opt test mochitest-other on 2012-05-10 18:55:11
slave: talos-r3-fed64-028
TEST-UNEXPECTED-FAIL | chrome://mochitests/content/browser/netwerk/test/browser/browser_NetUtil.js | request succeeded
TEST-UNEXPECTED-FAIL | chrome://mochitests/content/browser/netwerk/test/browser/browser_NetUtil.js | Test timed out
Comment 45•14 years ago
|
||
| Comment hidden (Legacy TBPL/Treeherder Robot) |
philor
https://tbpl.mozilla.org/php/getParsedLog.php?id=11668044&tree=Mozilla-Inbound
Rev3 Fedora 12x64 mozilla-inbound pgo test mochitest-other on 2012-05-10 22:46:22
slave: talos-r3-fed64-037
TEST-UNEXPECTED-FAIL | chrome://mochitests/content/browser/netwerk/test/browser/browser_NetUtil.js | request succeeded
TEST-UNEXPECTED-FAIL | chrome://mochitests/content/browser/netwerk/test/browser/browser_NetUtil.js | Test timed out
Comment 46•14 years ago
|
||
| Comment hidden (Legacy TBPL/Treeherder Robot) |
philor
https://tbpl.mozilla.org/php/getParsedLog.php?id=11677034&tree=Fx-Team
Rev3 Fedora 12x64 fx-team pgo test mochitest-other on 2012-05-11 06:56:26
slave: talos-r3-fed64-045
TEST-UNEXPECTED-FAIL | chrome://mochitests/content/browser/netwerk/test/browser/browser_NetUtil.js | request succeeded
TEST-UNEXPECTED-FAIL | chrome://mochitests/content/browser/netwerk/test/browser/browser_NetUtil.js | Test timed out
Comment 47•14 years ago
|
||
| Comment hidden (Legacy TBPL/Treeherder Robot) |
edmorley
https://tbpl.mozilla.org/php/getParsedLog.php?id=11677097&tree=Firefox
Rev3 Fedora 12x64 mozilla-central pgo test mochitest-other on 2012-05-11 06:59:32
slave: talos-r3-fed64-063
TEST-UNEXPECTED-FAIL | chrome://mochitests/content/browser/netwerk/test/browser/browser_NetUtil.js | request succeeded
TEST-UNEXPECTED-FAIL | chrome://mochitests/content/browser/netwerk/test/browser/browser_NetUtil.js | Test timed out
Comment 48•14 years ago
|
||
| Comment hidden (Legacy TBPL/Treeherder Robot) |
robcee
https://tbpl.mozilla.org/php/getParsedLog.php?id=11685139&tree=Fx-Team
Rev3 Fedora 12x64 fx-team opt test mochitest-other on 2012-05-11 12:44:38
slave: talos-r3-fed64-007
TEST-UNEXPECTED-FAIL | chrome://mochitests/content/browser/netwerk/test/browser/browser_NetUtil.js | request succeeded
TEST-UNEXPECTED-FAIL | chrome://mochitests/content/browser/netwerk/test/browser/browser_NetUtil.js | Test timed out
Comment 49•14 years ago
|
||
| Comment hidden (Legacy TBPL/Treeherder Robot) |
philor
https://tbpl.mozilla.org/php/getParsedLog.php?id=11687583&tree=Services-Central
Rev3 Fedora 12x64 services-central opt test mochitest-other on 2012-05-11 13:59:37
slave: talos-r3-fed64-043
TEST-UNEXPECTED-FAIL | chrome://mochitests/content/browser/netwerk/test/browser/browser_NetUtil.js | request succeeded
TEST-UNEXPECTED-FAIL | chrome://mochitests/content/browser/netwerk/test/browser/browser_NetUtil.js | Test timed out
Comment 50•14 years ago
|
||
| Comment hidden (Legacy TBPL/Treeherder Robot) |
philor
https://tbpl.mozilla.org/php/getParsedLog.php?id=11721418&tree=Mozilla-Inbound
Rev3 Fedora 12x64 mozilla-inbound opt test mochitest-other on 2012-05-13 22:01:12
slave: talos-r3-fed64-025
TEST-UNEXPECTED-FAIL | chrome://mochitests/content/browser/netwerk/test/browser/browser_NetUtil.js | request succeeded
TEST-UNEXPECTED-FAIL | chrome://mochitests/content/browser/netwerk/test/browser/browser_NetUtil.js | Test timed out
Comment 51•14 years ago
|
||
| Comment hidden (Legacy TBPL/Treeherder Robot) |
philor
https://tbpl.mozilla.org/php/getParsedLog.php?id=11745857&tree=Firefox
Rev3 Fedora 12x64 mozilla-central pgo test mochitest-other on 2012-05-14 19:06:03
slave: talos-r3-fed64-047
TEST-UNEXPECTED-FAIL | chrome://mochitests/content/browser/netwerk/test/browser/browser_NetUtil.js | request succeeded
TEST-UNEXPECTED-FAIL | chrome://mochitests/content/browser/netwerk/test/browser/browser_NetUtil.js | Test timed out
Comment 52•14 years ago
|
||
| Comment hidden (Legacy TBPL/Treeherder Robot) |
edmorley
https://tbpl.mozilla.org/php/getParsedLog.php?id=11759399&tree=Firefox
Rev3 Fedora 12x64 mozilla-central pgo test mochitest-other on 2012-05-15 04:31:34
slave: talos-r3-fed64-056
TEST-UNEXPECTED-FAIL | chrome://mochitests/content/browser/netwerk/test/browser/browser_NetUtil.js | request succeeded
TEST-UNEXPECTED-FAIL | chrome://mochitests/content/browser/netwerk/test/browser/browser_NetUtil.js | Test timed out
Comment 53•14 years ago
|
||
Perhaps this is caused by false-positive TLS intolerance like bug 749890. After bug 749890 is fixed, let's see if this this still happens.
Depends on: 749890
Comment 54•14 years ago
|
||
| Comment hidden (Legacy TBPL/Treeherder Robot) |
jesup
https://tbpl.mozilla.org/php/getParsedLog.php?id=15937968&tree=Mozilla-Inbound
Rev3 Fedora 12 mozilla-inbound pgo test mochitest-other on 2012-10-08 16:38:33
slave: talos-r3-fed-057
TEST-UNEXPECTED-FAIL | chrome://mochitests/content/browser/netwerk/test/browser/browser_NetUtil.js | Test timed out
TEST-UNEXPECTED-FAIL | chrome://mochitests/content/browser/toolkit/components/social/test/browser/browser_frameworker.js | Test timed out
TEST-UNEXPECTED-FAIL | chrome://mochitests/content/browser/toolkit/mozapps/extensions/test/browser-window/browser_discovery.js | Test timed out
TEST-UNEXPECTED-FAIL | chrome://mochitests/content/browser/toolkit/mozapps/extensions/test/browser-window/browser_discovery.js | Found unexpected add-ons manager window still open
TEST-UNEXPECTED-FAIL | chrome://mochitests/content/browser/toolkit/mozapps/extensions/test/browser-window/browser_discovery.js | an unexpected uncaught JS exception reported through window.onerror - TypeError: browser.removeProgressListener is not a function at chrome://mochitests/content/browser/toolkit/mozapps/extensions/test/browser-window/browser_discovery.js:174
TEST-UNEXPECTED-FAIL | chrome://mochitests/content/browser/toolkit/mozapps/extensions/test/browser-window/browser_dragdrop.js | an unexpected uncaught JS exception reported through window.onerror - NS_ERROR_FAILURE: Component returned failure code: 0x80004005 (NS_ERROR_FAILURE) [nsIZipReader.open] at chrome://mochikit/content/chrome-harness.js:269
TEST-UNEXPECTED-FAIL | chrome://mochitests/content/browser/toolkit/mozapps/extensions/test/browser-window/browser_dragdrop.js | Test timed out
TEST-UNEXPECTED-FAIL | chrome://mochitests/content/browser/toolkit/mozapps/extensions/test/browser-window/browser_dragdrop.js | Found unexpected add-ons manager window still open
TEST-UNEXPECTED-FAIL | chrome://mochitests/content/browser/toolkit/mozapps/extensions/test/browser/browser_bug557956.js | Test timed out
TEST-UNEXPECTED-FAIL | chrome://mochitests/content/browser/toolkit/mozapps/extensions/test/browser/browser_bug557956.js | Found unexpected add-ons compatibility window still open
TEST-UNEXPECTED-FAIL | chrome://mochitests/content/browser/toolkit/mozapps/extensions/test/browser/browser_bug557956.js | Should not have seen an install of http://example.com/browser/toolkit/mozapps/extensions/test/browser/browser_bug557956_7_2.xpi in state 0
TEST-UNEXPECTED-FAIL | chrome://mochitests/content/browser/toolkit/mozapps/extensions/test/browser/browser_bug557956.js | Should not have seen an install of http://example.com/browser/toolkit/mozapps/extensions/test/browser/browser_bug557956_8_2.xpi in state 0
TEST-UNEXPECTED-FAIL | chrome://mochitests/content/browser/toolkit/mozapps/extensions/test/browser/browser_bug557956.js | Should not have seen an install of http://example.com/browser/toolkit/mozapps/extensions/test/browser/browser_bug557956_9_2.xpi in state 0
TEST-UNEXPECTED-FAIL | chrome://mochitests/content/browser/toolkit/mozapps/extensions/test/browser/browser_bug557956.js | Should not have seen an install of http://example.com/browser/toolkit/mozapps/extensions/test/browser/browser_bug557956_7_2.xpi in state 0
TEST-UNEXPECTED-FAIL | chrome://mochitests/content/browser/toolkit/mozapps/extensions/test/browser/browser_bug557956.js | Should not have seen an install of http://example.com/browser/toolkit/mozapps/extensions/test/browser/browser_bug557956_8_2.xpi in state 0
TEST-UNEXPECTED-FAIL | chrome://mochitests/content/browser/toolkit/mozapps/extensions/test/browser/browser_bug557956.js | Should not have seen an install of http://example.com/browser/toolkit/mozapps/extensions/test/browser/browser_bug557956_9_2.xpi in state 0
TEST-UNEXPECTED-FAIL | chrome://mochitests/content/browser/toolkit/mozapps/extensions/test/browser/browser_bug596336.js | Should be one item in the list - Got 2, expected 1
TEST-UNEXPECTED-FAIL | chrome://mochitests/content/browser/toolkit/mozapps/extensions/test/browser/browser_bug596336.js | Should be one item in the list - Got 2, expected 1
TEST-UNEXPECTED-FAIL | chrome://mochitests/content/browser/toolkit/mozapps/extensions/test/browser/browser_bug596336.js | Should be no items in the list - Got 1, expected 0
TEST-UNEXPECTED-FAIL | chrome://mochitests/content/browser/toolkit/mozapps/extensions/test/browser/browser_bug596336.js | Should be one item in the list - Got 2, expected 1
TEST-UNEXPECTED-FAIL | chrome://mochitests/content/browser/toolkit/mozapps/extensions/test/browser/browser_bug596336.js | Should be one item in the list - Got 2, expected 1
TEST-UNEXPECTED-FAIL | chrome://mochitests/content/browser/toolkit/mozapps/extensions/test/browser/browser_bug596336.js | Should be no items in the list - Got 1, expected 0
TEST-UNEXPECTED-FAIL | chrome://mochitests/content/browser/toolkit/mozapps/extensions/test/browser/browser_bug596336.js | Should be one item in the list - Got 2, expected 1
TEST-UNEXPECTED-FAIL | chrome://mochitests/content/browser/toolkit/mozapps/extensions/test/browser/browser_bug596336.js | Should be one item in the list - Got 2, expected 1
TEST-UNEXPECTED-FAIL | chrome://mochitests/content/browser/toolkit/mozapps/extensions/test/browser/browser_bug596336.js | Should be no items in the list - Got 1, expected 0
TEST-UNEXPECTED-FAIL | chrome://mochitests/content/browser/toolkit/mozapps/extensions/test/browser/browser_bug596336.js | Should be one item in the list - Got 2, expected 1
TEST-UNEXPECTED-FAIL | chrome://mochitests/content/browser/toolkit/mozapps/extensions/test/browser/browser_bug596336.js | Should be one item in the list - Got 2, expected 1
TEST-UNEXPECTED-FAIL | chrome://mochitests/content/browser/toolkit/mozapps/extensions/test/browser/browser_bug596336.js | Should be no items in the list - Got 1, expected 0
TEST-UNEXPECTED-FAIL | chrome://mochitests/content/browser/toolkit/mozapps/extensions/test/browser/browser_checkAddonCompatibility.js | extension Addon10 1.0 should be compatible
TEST-UNEXPECTED-FAIL | chrome://mochitests/content/browser/toolkit/mozapps/extensions/test/browser/browser_checkAddonCompatibility.js | As this test failed, test browser_bug557956.js should have failed, too.
TEST-UNEXPECTED-FAIL | chrome://mochitests/content/browser/toolkit/mozapps/extensions/test/browser/browser_discovery.js | Test timed out
TEST-UNEXPECTED-FAIL | chrome://mochitests/content/browser/toolkit/mozapps/extensions/test/browser/browser_discovery.js | Found a tab after previous test timed out: about:addons
TEST-UNEXPECTED-FAIL | chrome://mochitests/content/browser/toolkit/mozapps/extensions/test/browser/browser_dragdrop.js | an unexpected uncaught JS exception reported through window.onerror - NS_ERROR_FAILURE: Component returned failure code: 0x80004005 (NS_ERROR_FAILURE) [nsIZipReader.open] at chrome://mochikit/content/chrome-harness.js:269
TEST-UNEXPECTED-FAIL | chrome://mochitests/content/browser/toolkit/mozapps/extensions/test/browser/browser_dragdrop.js | Test timed out
TEST-UNEXPECTED-FAIL | chrome://mochitests/content/browser/toolkit/mozapps/extensions/test/browser/browser_dragdrop.js | Found a tab after previous test timed out: about:addons
TEST-UNEXPECTED-FAIL | chrome://mochitests/content/browser/toolkit/mozapps/extensions/test/browser/browser_install.js | Should be only one item in the list - Got 2, expected 1
TEST-UNEXPECTED-FAIL | chrome://mochitests/content/browser/toolkit/mozapps/extensions/test/browser/browser_install.js | Should be no items in the list - Got 1, expected 0
TEST-UNEXPECTED-FAIL | chrome://mochitests/content/browser/toolkit/mozapps/extensions/test/browser/browser_install.js | Should be only one item in the list - Got 2, expected 1
TEST-UNEXPECTED-FAIL | chrome://mochitests/content/browser/toolkit/mozapps/extensions/test/browser/browser_install.js | Should be no items in the list - Got 1, expected 0
TEST-UNEXPECTED-FAIL | chrome://mochitests/content/browser/toolkit/mozapps/extensions/test/browser/browser_install.js | Should be only one item in the list - Got 2, expected 1
TEST-UNEXPECTED-FAIL | chrome://mochitests/content/browser/toolkit/mozapps/extensions/test/browser/browser_install.js | Should be no items in the list - Got 1, expected 0
TEST-UNEXPECTED-FAIL | chrome://mochitests/content/browser/toolkit/mozapps/extensions/test/browser/browser_install.js | Should be only one item in the list - Got 2, expected 1
TEST-UNEXPECTED-FAIL | chrome://mochitests/content/browser/toolkit/mozapps/extensions/test/browser/browser_install.js | Should be no items in the list - Got 1, expected 0
TEST-UNEXPECTED-FAIL | chrome://mochitests/content/browser/toolkit/mozapps/extensions/test/browser/browser_install.js | Should be no items in the list - Got 1, expected 0
TEST-UNEXPECTED-FAIL | chrome://mochitests/content/browser/toolkit/mozapps/extensions/test/browser/browser_install.js | Should be no items in the list - Got 1, expected 0
TEST-UNEXPECTED-FAIL | chrome://mochitests/content/browser/toolkit/mozapps/extensions/test/browser/browser_install.js | Should be only one item in the list - Got 2, expected 1
TEST-UNEXPECTED-FAIL | chrome://mochitests/content/browser/toolkit/mozapps/extensions/test/browser/browser_install.js | Should be only one item in the list - Got 2, expected 1
TEST-UNEXPECTED-FAIL | chrome://mochitests/content/browser/toolkit/mozapps/extensions/test/browser/browser_install.js | Should be only one item in the list - Got 2, expected 1
TEST-UNEXPECTED-FAIL | chrome://mochitests/content/browser/toolkit/mozapps/extensions/test/browser/browser_install.js | Should be only one item in the list once the update has started - Got 2, expected 1
TEST-UNEXPECTED-FAIL | chrome://mochitests/content/browser/toolkit/mozapps/extensions/test/browser/browser_install.js | Should be only one item in the list - Got 2, expected 1
TEST-UNEXPECTED-FAIL | chrome://mochitests/content/browser/toolkit/mozapps/extensions/test/browser/browser_install.js | Should be only one item in the list - Got 2, expected 1
TEST-UNEXPECTED-FAIL | chrome://mochitests/content/browser/toolkit/mozapps/extensions/test/browser/browser_install.js | Should be only one item in the list - Got 2, expected 1
TEST-UNEXPECTED-FAIL | chrome://mochitests/content/browser/toolkit/mozapps/extensions/test/browser/browser_install.js | Should be only one item in the list - Got 2, expected 1
TEST-UNEXPECTED-FAIL | chrome://mochitests/content/browser/toolkit/mozapps/extensions/test/browser/browser_install.js | Should be no items in the list - Got 2, expected 1
TEST-UNEXPECTED-FAIL | chrome://mochitests/content/browser/toolkit/mozapps/extensions/test/browser/browser_install.js | Should be no items in the list - Got 2, expected 1
TEST-UNEXPECTED-FAIL | chrome://mochitests/content/browser/toolkit/mozapps/extensions/test/browser/browser_installssl.js | Test timed out
TEST-UNEXPECTED-FAIL | chrome://mochitests/content/browser/toolkit/mozapps/extensions/test/browser/browser_installssl.js | Should not have seen an install of https://nocert.example.com/browser/toolkit/mozapps/extensions/test/browser/addons/browser_installssl.xpi in state 1
TEST-UNEXPECTED-FAIL | chrome://mochitests/content/browser/toolkit/mozapps/extensions/test/browser/browser_installssl.js | Timed out in the middle of downloading https://nocert.example.com/browser/toolkit/mozapps/extensions/test/browser/addons/browser_installssl.xpi
TEST-UNEXPECTED-FAIL | chrome://mochitests/content/browser/toolkit/mozapps/extensions/test/browser/browser_list.js | Should be nine add-ons installed - Got 10, expected 9
TEST-UNEXPECTED-FAIL | chrome://mochitests/content/browser/toolkit/mozapps/extensions/test/browser/browser_list.js | Should be nine add-ons installed - Got 10, expected 9
TEST-UNEXPECTED-FAIL | chrome://mochitests/content/browser/toolkit/mozapps/extensions/test/browser/browser_list.js | Should be nine add-ons installed - Got 10, expected 9
TEST-UNEXPECTED-FAIL | chrome://mochitests/content/browser/toolkit/mozapps/extensions/test/browser/browser_select_compatoverrides.js | Should get expected addon - Got addon10@tests.mozilla.org, expected addon1@tests.mozilla.org
TEST-UNEXPECTED-FAIL | chrome://mochitests/content/browser/toolkit/mozapps/extensions/test/browser/browser_select_compatoverrides.js | Test timed out
TEST-UNEXPECTED-FAIL | chrome://mochitests/content/browser/toolkit/mozapps/extensions/test/browser/browser_select_confirm.js | Incompatible list should be hidden
TEST-UNEXPECTED-FAIL | chrome://mochitests/content/browser/toolkit/mozapps/extensions/test/browser/browser_select_confirm.js | Should be two add-ons waiting to be compatible (plus the header) - Got 4, expected 3
TEST-UNEXPECTED-FAIL | chrome://mochitests/content/browser/toolkit/mozapps/extensions/test/browser/browser_select_confirm.js | Should be the right add-on ID - Got addon10@tests.mozilla.org, expected test1@tests.mozilla.org
TEST-UNEXPECTED-FAIL | chrome://mochitests/content/browser/toolkit/mozapps/extensions/test/browser/browser_select_confirm.js | Should be the right add-on name - Got Addon10, expected Test Add-on 1
TEST-UNEXPECTED-FAIL | chrome://mochitests/content/browser/toolkit/mozapps/extensions/test/browser/browser_select_confirm.js | Should be the right add-on ID - Got test1@tests.mozilla.org, expected test3@tests.mozilla.org
TEST-UNEXPECTED-FAIL | chrome://mochitests/content/browser/toolkit/mozapps/extensions/test/browser/browser_select_confirm.js | Should be the right add-on name - Got Test Add-on 1, expected Test Add-on 3
TEST-UNEXPECTED-FAIL | chrome://mochitests/content/browser/toolkit/mozapps/extensions/test/browser/browser_select_confirm.js | Incompatible list should be hidden
TEST-UNEXPECTED-FAIL | chrome://mochitests/content/browser/toolkit/mozapps/extensions/test/browser/browser_select_selection.js | Test timed out
TEST-UNEXPECTED-FAIL | chrome://mochitests/content/browser/toolkit/mozapps/extensions/test/browser/browser_select_selection.js | Found a after previous test timed out
TEST-UNEXPECTED-FAIL | chrome://mochitests/content/browser/toolkit/mozapps/extensions/test/browser/browser_sorting.js | Should have seen the right order - Got ["test2@tests.mozilla.org", "test4@tests.mozilla.org", "test3@tests.mozilla.org", "test5@tests.mozilla.org", "test1@tests.mozilla.org", "test7@tests.mozilla.org", "test8@tests.mozilla.org", "test6@tests.mozilla.org", "test10@tests.mozilla.org", "test9@tests.mozilla.org", "test11@tests.mozilla.org", "test13@tests.mozilla.org", "test12@tests.mozilla.org", "test14@tests.mozilla.org", "test15@tests.mozilla.org", "addon10@tests.mozilla.org", "test17@tests.mozilla.org", "test19@tests.mozilla.org", "test16@tests.mozilla.org", "test20@tests.mozilla.org", "test18@tests.mozilla.org"], expected ["test2@tests.mozilla.org", "test4@tests.mozilla.org", "test3@tests.mozilla.org", "test5@tests.mozilla.org", "test1@tests.mozilla.org", "test7@tests.mozilla.org", "test8@tests.mozilla.org", "test6@tests.mozilla.org", "test10@tests.mozilla.org", "test9@tests.mozilla.org", "test11@tests.mozilla.org", "test13@tests.mozilla.org", "test12@tests.mozilla.org", "test14@tests.mozilla.org", "test15@tests.mozilla.org", "test17@tests.mozilla.org", "test19@tests.mozilla.org", "test16@tests.mozilla.org", "test20@tests.mozilla.org", "test18@tests.mozilla.org"]
TEST-UNEXPECTED-FAIL | chrome://mochitests/content/browser/toolkit/mozapps/extensions/test/browser/browser_sorting.js | Should have seen the right order - Got ["test5@tests.mozilla.org", "test3@tests.mozilla.org", "test1@tests.mozilla.org", "test2@tests.mozilla.org", "test4@tests.mozilla.org", "test10@tests.mozilla.org", "test9@tests.mozilla.org", "test8@tests.mozilla.org", "test6@tests.mozilla.org", "test7@tests.mozilla.org", "test12@tests.mozilla.org", "test14@tests.mozilla.org", "test15@tests.mozilla.org", "test13@tests.mozilla.org", "test11@tests.mozilla.org", "addon10@tests.mozilla.org", "test20@tests.mozilla.org", "test17@tests.mozilla.org", "test18@tests.mozilla.org", "test19@tests.mozilla.org", "test16@tests.mozilla.org"], expected ["test5@tests.mozilla.org", "test3@tests.mozilla.org", "test1@tests.mozilla.org", "test2@tests.mozilla.org", "test4@tests.mozilla.org", "test10@tests.mozilla.org", "test9@tests.mozilla.org", "test8@tests.mozilla.org", "test6@tests.mozilla.org", "test7@tests.mozilla.org", "test12@tests.mozilla.org", "test14@tests.mozilla.org", "test15@tests.mozilla.org", "test13@tests.mozilla.org", "test11@tests.mozilla.org", "test20@tests.mozilla.org", "test17@tests.mozilla.org", "test18@tests.mozilla.org", "test19@tests.mozilla.org", "test16@tests.mozilla.org"]
TEST-UNEXPECTED-FAIL | chrome://mochitests/content/browser/toolkit/mozapps/extensions/test/browser/browser_sorting.js | Should have seen the right order - Got ["test4@tests.mozilla.org", "test2@tests.mozilla.org", "test1@tests.mozilla.org", "test3@tests.mozilla.org", "test5@tests.mozilla.org", "test7@tests.mozilla.org", "test6@tests.mozilla.org", "test8@tests.mozilla.org", "test9@tests.mozilla.org", "test10@tests.mozilla.org", "test11@tests.mozilla.org", "test13@tests.mozilla.org", "test15@tests.mozilla.org", "test14@tests.mozilla.org", "test12@tests.mozilla.org", "test16@tests.mozilla.org", "test19@tests.mozilla.org", "test18@tests.mozilla.org", "test17@tests.mozilla.org", "test20@tests.mozilla.org", "addon10@tests.mozilla.org"], expected ["test4@tests.mozilla.org", "test2@tests.mozilla.org", "test1@tests.mozilla.org", "test3@tests.mozilla.org", "test5@tests.mozilla.org", "test7@tests.mozilla.org", "test6@tests.mozilla.org", "test8@tests.mozilla.org", "test9@tests.mozilla.org", "test10@tests.mozilla.org", "test11@tests.mozilla.org", "test13@tests.mozilla.org", "test15@tests.mozilla.org", "test14@tests.mozilla.org", "test12@tests.mozilla.org", "test16@tests.mozilla.org", "test19@tests.mozilla.org", "test18@tests.mozilla.org", "test17@tests.mozilla.org", "test20@tests.mozilla.org"]
TEST-UNEXPECTED-FAIL | chrome://mochitests/content/browser/toolkit/mozapps/extensions/test/browser/browser_sorting.js | Should have seen the right order - Got ["test2@tests.mozilla.org", "test4@tests.mozilla.org", "test3@tests.mozilla.org", "test5@tests.mozilla.org", "test1@tests.mozilla.org", "test7@tests.mozilla.org", "test8@tests.mozilla.org", "test6@tests.mozilla.org", "test10@tests.mozilla.org", "test9@tests.mozilla.org", "test11@tests.mozilla.org", "test13@tests.mozilla.org", "test12@tests.mozilla.org", "test14@tests.mozilla.org", "test15@tests.mozilla.org", "addon10@tests.mozilla.org", "test17@tests.mozilla.org", "test19@tests.mozilla.org", "test16@tests.mozilla.org", "test20@tests.mozilla.org", "test18@tests.mozilla.org"], expected ["test2@tests.mozilla.org", "test4@tests.mozilla.org", "test3@tests.mozilla.org", "test5@tests.mozilla.org", "test1@tests.mozilla.org", "test7@tests.mozilla.org", "test8@tests.mozilla.org", "test6@tests.mozilla.org", "test10@tests.mozilla.org", "test9@tests.mozilla.org", "test11@tests.mozilla.org", "test13@tests.mozilla.org", "test12@tests.mozilla.org", "test14@tests.mozilla.org", "test15@tests.mozilla.org", "test17@tests.mozilla.org", "test19@tests.mozilla.org", "test16@tests.mozilla.org", "test20@tests.mozilla.org", "test18@tests.mozilla.org"]
TEST-UNEXPECTED-FAIL | chrome://mochitests/content/browser/toolkit/mozapps/extensions/test/browser/browser_sorting.js | Should have seen the right order - Got ["test1@tests.mozilla.org", "test5@tests.mozilla.org", "test3@tests.mozilla.org", "test4@tests.mozilla.org", "test2@tests.mozilla.org", "test9@tests.mozilla.org", "test10@tests.mozilla.org", "test6@tests.mozilla.org", "test8@tests.mozilla.org", "test7@tests.mozilla.org", "test15@tests.mozilla.org", "test14@tests.mozilla.org", "test12@tests.mozilla.org", "test13@tests.mozilla.org", "test11@tests.mozilla.org", "test18@tests.mozilla.org", "test20@tests.mozilla.org", "test16@tests.mozilla.org", "test19@tests.mozilla.org", "test17@tests.mozilla.org", "addon10@tests.mozilla.org"], expected ["test1@tests.mozilla.org", "test5@tests.mozilla.org", "test3@tests.mozilla.org", "test4@tests.mozilla.org", "test2@tests.mozilla.org", "test9@tests.mozilla.org", "test10@tests.mozilla.org", "test6@tests.mozilla.org", "test8@tests.mozilla.org", "test7@tests.mozilla.org", "test15@tests.mozilla.org", "test14@tests.mozilla.org", "test12@tests.mozilla.org", "test13@tests.mozilla.org", "test11@tests.mozilla.org", "test18@tests.mozilla.org", "test20@tests.mozilla.org", "test16@tests.mozilla.org", "test19@tests.mozilla.org", "test17@tests.mozilla.org"]
TEST-UNEXPECTED-FAIL | chrome://mochitests/content/browser/toolkit/mozapps/extensions/test/browser/browser_updatessl.js | Test timed out
TEST-UNEXPECTED-FAIL | chrome://mochitests/content/browser/toolkit/mozapps/extensions/test/xpinstall/browser_httphash.js | Test timed out
TEST-UNEXPECTED-FAIL | chrome://mochitests/content/browser/toolkit/mozapps/extensions/test/xpinstall/browser_httphash.js | Should be no active installs at the end of the test - Got 1, expected 0
TEST-UNEXPECTED-FAIL | chrome://mochitests/content/browser/toolkit/mozapps/extensions/test/xpinstall/browser_httphash.js | Found a tab after previous test timed out: http://example.com/browser/toolkit/mozapps/extensions/test/xpinstall/installtrigger.html?%7B%22Unsigned%20XPI%22%3A%7B%22URL%22%3A%22https%3A%2F%2Fexample.com%2Fbrowser%2Ftoolkit%2Fmozapps%2Fextensions%2Ftest%2Fxpinstall%2FhashRedirect.sjs%3Fsha1%3A3d0dc22e1f394e159b08aaf5f0f97de4d5c65f4f%7Chttp%3A%2F%2Fexample.com%2Fbrowser%2Ftoolkit%2Fmozapps%2Fextensions%2Ftest%2Fxpinstall%2Funsigned.xpi%22%7D%7D
TEST-UNEXPECTED-FAIL | chrome://mochitests/content/browser/toolkit/mozapps/extensions/test/xpinstall/browser_httphash2.js | Test timed out
TEST-UNEXPECTED-FAIL | chrome://mochitests/content/browser/toolkit/mozapps/extensions/test/xpinstall/browser_httphash2.js | Should be no active installs at the end of the test - Got 1, expected 0
TEST-UNEXPECTED-FAIL | chrome://mochitests/content/browser/toolkit/mozapps/extensions/test/xpinstall/browser_httphash2.js | Found a tab after previous test timed out: http://example.com/browser/toolkit/mozapps/extensions/test/xpinstall/installtrigger.html?%7B%22Unsigned%20XPI%22%3A%7B%22URL%22%3A%22https%3A%2F%2Fexample.com%2Fbrowser%2Ftoolkit%2Fmozapps%2Fextensions%2Ftest%2Fxpinstall%2FhashRedirect.sjs%3Fsha1%3Afoobar%7Chttp%3A%2F%2Fexample.com%2Fbrowser%2Ftoolkit%2Fmozapps%2Fextensions%2Ftest%2Fxpinstall%2Funsigned.xpi%22%7D%7D
TEST-UNEXPECTED-FAIL | chrome://mochitests/content/browser/toolkit/mozapps/extensions/test/xpinstall/browser_httphash3.js | Test timed out
TEST-UNEXPECTED-FAIL | chrome://mochitests/content/browser/toolkit/mozapps/extensions/test/xpinstall/browser_httphash3.js | Should be no active installs at the end of the test - Got 1, expected 0
TEST-UNEXPECTED-FAIL | chrome://mochitests/content/browser/toolkit/mozapps/extensions/test/xpinstall/browser_httphash3.js | Found a tab after previous test timed out: http://example.com/browser/toolkit/mozapps/extensions/test/xpinstall/installtrigger.html?%7B%22Unsigned%20XPI%22%3A%7B%22URL%22%3A%22https%3A%2F%2Fexample.com%2Fbrowser%2Ftoolkit%2Fmozapps%2Fextensions%2Ftest%2Fxpinstall%2FhashRedirect.sjs%3Fsha1%3Afoobar%7Chttp%3A%2F%2Fexample.com%2Fbrowser%2Ftoolkit%2Fmozapps%2Fextensions%2Ftest%2Fxpinstall%2Funsigned.xpi%22%2C%22Hash%22%3A%22sha1%3A3d0dc22e1f394e159b08aaf5f0f97de4d5c65f4f%22%7D%7D
TEST-UNEXPECTED-FAIL | chrome://mochitests/content/browser/toolkit/mozapps/extensions/test/xpinstall/browser_httphash5.js | Test timed out
TEST-UNEXPECTED-FAIL | chrome://mochitests/content/browser/toolkit/mozapps/extensions/test/xpinstall/browser_httphash5.js | Should be no active installs at the end of the test - Got 1, expected 0
TEST-UNEXPECTED-FAIL | chrome://mochitests/content/browser/toolkit/mozapps/extensions/test/xpinstall/browser_httphash5.js | Found a tab after previous test timed out: http://example.com/browser/toolkit/mozapps/extensions/test/xpinstall/installtrigger.html?%7B%22Unsigned%20XPI%22%3A%7B%22URL%22%3A%22https%3A%2F%2Fexample.com%2Fbrowser%2Ftoolkit%2Fmozapps%2Fextensions%2Ftest%2Fxpinstall%2FhashRedirect.sjs%3Fsha1%3A3d0dc22e1f394e159b08aaf5f0f97de4d5c65f4f%7Chttps%3A%2F%2Fexample.com%2Fbrowser%2Ftoolkit%2Fmozapps%2Fextensions%2Ftest%2Fxpinstall%2FhashRedirect.sjs%3Fsha1%3Afoobar%7Chttp%3A%2F%2Fexample.com%2Fbrowser%2Ftoolkit%2Fmozapps%2Fextensions%2Ftest%2Fxpinstall%2Funsigned.xpi%22%7D%7D
TEST-UNEXPECTED-FAIL | chrome://mochitests/content/browser/toolkit/mozapps/extensions/test/xpinstall/browser_httphash6.js | application timed out after 330 seconds with no output
PROCESS-CRASH | chrome://mochitests/content/browser/toolkit/mozapps/extensions/test/xpinstall/browser_httphash6.js | application crashed (minidump found)
Thread 0 (crashed)
Comment 55•13 years ago
|
||
| Comment hidden (Legacy TBPL/Treeherder Robot) |
jfkthame
https://tbpl.mozilla.org/php/getParsedLog.php?id=16009288&tree=Mozilla-Aurora
Rev3 Fedora 12 mozilla-aurora pgo test mochitest-other on 2012-10-11 02:47:21
slave: talos-r3-fed-019
TEST-UNEXPECTED-FAIL | chrome://mochitests/content/browser/netwerk/test/browser/browser_NetUtil.js | Test timed out
TEST-UNEXPECTED-FAIL | chrome://mochitests/content/browser/toolkit/components/social/test/browser/browser_frameworker.js | Test timed out
TEST-UNEXPECTED-FAIL | chrome://mochitests/content/browser/toolkit/mozapps/extensions/test/browser-window/browser_discovery.js | Test timed out
TEST-UNEXPECTED-FAIL | chrome://mochitests/content/browser/toolkit/mozapps/extensions/test/browser-window/browser_discovery.js | Found unexpected add-ons manager window still open
TEST-UNEXPECTED-FAIL | chrome://mochitests/content/browser/toolkit/mozapps/extensions/test/browser/browser_bug557956.js | Test timed out
TEST-UNEXPECTED-FAIL | chrome://mochitests/content/browser/toolkit/mozapps/extensions/test/browser/browser_bug557956.js | Found unexpected add-ons compatibility window still open
TEST-UNEXPECTED-FAIL | chrome://mochitests/content/browser/toolkit/mozapps/extensions/test/browser/browser_bug591465.js | 'Enable' should be visible
TEST-UNEXPECTED-FAIL | chrome://mochitests/content/browser/toolkit/mozapps/extensions/test/browser/browser_bug596336.js | Should be one item in the list - Got 10, expected 1
TEST-UNEXPECTED-FAIL | chrome://mochitests/content/browser/toolkit/mozapps/extensions/test/browser/browser_bug596336.js | Should be one item in the list - Got 10, expected 1
TEST-UNEXPECTED-FAIL | chrome://mochitests/content/browser/toolkit/mozapps/extensions/test/browser/browser_bug596336.js | Should be no items in the list - Got 9, expected 0
TEST-UNEXPECTED-FAIL | chrome://mochitests/content/browser/toolkit/mozapps/extensions/test/browser/browser_bug596336.js | Should be one item in the list - Got 10, expected 1
TEST-UNEXPECTED-FAIL | chrome://mochitests/content/browser/toolkit/mozapps/extensions/test/browser/browser_bug596336.js | Should be one item in the list - Got 10, expected 1
TEST-UNEXPECTED-FAIL | chrome://mochitests/content/browser/toolkit/mozapps/extensions/test/browser/browser_bug596336.js | Should be no items in the list - Got 9, expected 0
TEST-UNEXPECTED-FAIL | chrome://mochitests/content/browser/toolkit/mozapps/extensions/test/browser/browser_bug596336.js | Should be one item in the list - Got 10, expected 1
TEST-UNEXPECTED-FAIL | chrome://mochitests/content/browser/toolkit/mozapps/extensions/test/browser/browser_bug596336.js | Should be one item in the list - Got 10, expected 1
TEST-UNEXPECTED-FAIL | chrome://mochitests/content/browser/toolkit/mozapps/extensions/test/browser/browser_bug596336.js | Should be no items in the list - Got 9, expected 0
TEST-UNEXPECTED-FAIL | chrome://mochitests/content/browser/toolkit/mozapps/extensions/test/browser/browser_bug596336.js | Should be one item in the list - Got 10, expected 1
TEST-UNEXPECTED-FAIL | chrome://mochitests/content/browser/toolkit/mozapps/extensions/test/browser/browser_bug596336.js | Should be one item in the list - Got 10, expected 1
TEST-UNEXPECTED-FAIL | chrome://mochitests/content/browser/toolkit/mozapps/extensions/test/browser/browser_bug596336.js | Should be no items in the list - Got 9, expected 0
TEST-UNEXPECTED-FAIL | chrome://mochitests/content/browser/toolkit/mozapps/extensions/test/browser/browser_checkAddonCompatibility.js | extension Addon10 1.0 should be compatible
TEST-UNEXPECTED-FAIL | chrome://mochitests/content/browser/toolkit/mozapps/extensions/test/browser/browser_checkAddonCompatibility.js | extension Addon2 1.0 should be compatible
TEST-UNEXPECTED-FAIL | chrome://mochitests/content/browser/toolkit/mozapps/extensions/test/browser/browser_checkAddonCompatibility.js | extension Addon3 1.0 should be compatible
TEST-UNEXPECTED-FAIL | chrome://mochitests/content/browser/toolkit/mozapps/extensions/test/browser/browser_checkAddonCompatibility.js | extension Addon5 1.0 should be compatible
TEST-UNEXPECTED-FAIL | chrome://mochitests/content/browser/toolkit/mozapps/extensions/test/browser/browser_checkAddonCompatibility.js | extension Addon6 1.0 should be compatible
TEST-UNEXPECTED-FAIL | chrome://mochitests/content/browser/toolkit/mozapps/extensions/test/browser/browser_checkAddonCompatibility.js | extension Addon7 1.0 should be compatible
TEST-UNEXPECTED-FAIL | chrome://mochitests/content/browser/toolkit/mozapps/extensions/test/browser/browser_checkAddonCompatibility.js | extension Addon8 1.0 should be compatible
TEST-UNEXPECTED-FAIL | chrome://mochitests/content/browser/toolkit/mozapps/extensions/test/browser/browser_checkAddonCompatibility.js | extension Addon9 1.0 should be compatible
TEST-UNEXPECTED-FAIL | chrome://mochitests/content/browser/toolkit/mozapps/extensions/test/browser/browser_checkAddonCompatibility.js | As this test failed, test browser_bug557956.js should have failed, too.
TEST-UNEXPECTED-FAIL | chrome://mochitests/content/browser/toolkit/mozapps/extensions/test/browser/browser_details.js | Name should be correct - Got Addon2, expected Test add-on 2
TEST-UNEXPECTED-FAIL | chrome://mochitests/content/browser/toolkit/mozapps/extensions/test/browser/browser_details.js | Version should be correct - Got 1.0, expected 2.2
TEST-UNEXPECTED-FAIL | chrome://mochitests/content/browser/toolkit/mozapps/extensions/test/browser/browser_details.js | Icon should be correct - Got , expected chrome://foo/skin/icon.png
TEST-UNEXPECTED-FAIL | chrome://mochitests/content/browser/toolkit/mozapps/extensions/test/browser/browser_details.js | Creator should not be hidden
TEST-UNEXPECTED-FAIL | chrome://mochitests/content/browser/toolkit/mozapps/extensions/test/browser/browser_details.js | Creator name should not be hidden
TEST-UNEXPECTED-FAIL | chrome://mochitests/content/browser/toolkit/mozapps/extensions/test/browser/browser_details.js | Creator should be correct - Got , expected Mozilla
TEST-UNEXPECTED-FAIL | chrome://mochitests/content/browser/toolkit/mozapps/extensions/test/browser/browser_details.js | Screenshot should be visible
TEST-UNEXPECTED-FAIL | chrome://mochitests/content/browser/toolkit/mozapps/extensions/test/browser/browser_details.js | Should be showing the full sized screenshot - Got , expected chrome://branding/content/about.png
TEST-UNEXPECTED-FAIL | chrome://mochitests/content/browser/toolkit/mozapps/extensions/test/browser/browser_details.js | Screenshot dimensions should be set - Got , expected 200
TEST-UNEXPECTED-FAIL | chrome://mochitests/content/browser/toolkit/mozapps/extensions/test/browser/browser_details.js | Screenshot dimensions should be set - Got , expected 150
TEST-UNEXPECTED-FAIL | chrome://mochitests/content/browser/toolkit/mozapps/extensions/test/browser/browser_details.js | Screenshot should have loading attribute - Got false, expected true
TEST-UNEXPECTED-FAIL | chrome://mochitests/content/browser/toolkit/mozapps/extensions/test/browser/browser_details.js | Description should be correct - Got , expected Short description
TEST-UNEXPECTED-FAIL | chrome://mochitests/content/browser/toolkit/mozapps/extensions/test/browser/browser_details.js | Contributions section should be visible
TEST-UNEXPECTED-FAIL | chrome://mochitests/content/browser/toolkit/mozapps/extensions/test/browser/browser_details.js | Update date should be correct - Got 10/11/2012, expected 08/01/2010
TEST-UNEXPECTED-FAIL | chrome://mochitests/content/browser/toolkit/mozapps/extensions/test/browser/browser_details.js | Updates should be hidden
TEST-UNEXPECTED-FAIL | chrome://mochitests/content/browser/toolkit/mozapps/extensions/test/browser/browser_details.js | Remove button should be hidden
TEST-UNEXPECTED-FAIL | chrome://mochitests/content/browser/toolkit/mozapps/extensions/test/browser/browser_details.js | Warning message should be hidden
TEST-UNEXPECTED-FAIL | chrome://mochitests/content/browser/toolkit/mozapps/extensions/test/browser/browser_details.js | Test timed out
TEST-UNEXPECTED-FAIL | chrome://mochitests/content/browser/toolkit/mozapps/extensions/test/browser/browser_details.js | Found a tab after previous test timed out: about:addons
TEST-UNEXPECTED-FAIL | chrome://mochitests/content/browser/toolkit/mozapps/extensions/test/browser/browser_discovery.js | Test timed out
TEST-UNEXPECTED-FAIL | chrome://mochitests/content/browser/toolkit/mozapps/extensions/test/browser/browser_discovery.js | Found a tab after previous test timed out: about:addons
TEST-UNEXPECTED-FAIL | chrome://mochitests/content/browser/toolkit/mozapps/extensions/test/browser/browser_install.js | Should be only one item in the list - Got 10, expected 1
TEST-UNEXPECTED-FAIL | chrome://mochitests/content/browser/toolkit/mozapps/extensions/test/browser/browser_install.js | Should be no items in the list - Got 9, expected 0
TEST-UNEXPECTED-FAIL | chrome://mochitests/content/browser/toolkit/mozapps/extensions/test/browser/browser_install.js | Should be only one item in the list - Got 10, expected 1
TEST-UNEXPECTED-FAIL | chrome://mochitests/content/browser/toolkit/mozapps/extensions/test/browser/browser_install.js | Should be no items in the list - Got 9, expected 0
TEST-UNEXPECTED-FAIL | chrome://mochitests/content/browser/toolkit/mozapps/extensions/test/browser/browser_install.js | Should be only one item in the list - Got 10, expected 1
TEST-UNEXPECTED-FAIL | chrome://mochitests/content/browser/toolkit/mozapps/extensions/test/browser/browser_install.js | Should be no items in the list - Got 9, expected 0
TEST-UNEXPECTED-FAIL | chrome://mochitests/content/browser/toolkit/mozapps/extensions/test/browser/browser_install.js | Should be only one item in the list - Got 10, expected 1
TEST-UNEXPECTED-FAIL | chrome://mochitests/content/browser/toolkit/mozapps/extensions/test/browser/browser_install.js | Should be no items in the list - Got 9, expected 0
TEST-UNEXPECTED-FAIL | chrome://mochitests/content/browser/toolkit/mozapps/extensions/test/browser/browser_install.js | Should be no items in the list - Got 9, expected 0
TEST-UNEXPECTED-FAIL | chrome://mochitests/content/browser/toolkit/mozapps/extensions/test/browser/browser_install.js | Should be no items in the list - Got 9, expected 0
TEST-UNEXPECTED-FAIL | chrome://mochitests/content/browser/toolkit/mozapps/extensions/test/browser/browser_install.js | Should be only one item in the list - Got 10, expected 1
TEST-UNEXPECTED-FAIL | chrome://mochitests/content/browser/toolkit/mozapps/extensions/test/browser/browser_install.js | Should be only one item in the list - Got 10, expected 1
TEST-UNEXPECTED-FAIL | chrome://mochitests/content/browser/toolkit/mozapps/extensions/test/browser/browser_install.js | Should be only one item in the list - Got 10, expected 1
TEST-UNEXPECTED-FAIL | chrome://mochitests/content/browser/toolkit/mozapps/extensions/test/browser/browser_install.js | Should be only one item in the list once the update has started - Got 10, expected 1
TEST-UNEXPECTED-FAIL | chrome://mochitests/content/browser/toolkit/mozapps/extensions/test/browser/browser_install.js | Should be only one item in the list - Got 10, expected 1
TEST-UNEXPECTED-FAIL | chrome://mochitests/content/browser/toolkit/mozapps/extensions/test/browser/browser_install.js | Should be only one item in the list - Got 10, expected 1
TEST-UNEXPECTED-FAIL | chrome://mochitests/content/browser/toolkit/mozapps/extensions/test/browser/browser_install.js | Should be only one item in the list - Got 10, expected 1
TEST-UNEXPECTED-FAIL | chrome://mochitests/content/browser/toolkit/mozapps/extensions/test/browser/browser_install.js | Should be only one item in the list - Got 10, expected 1
TEST-UNEXPECTED-FAIL | chrome://mochitests/content/browser/toolkit/mozapps/extensions/test/browser/browser_install.js | Should be no items in the list - Got 10, expected 1
TEST-UNEXPECTED-FAIL | chrome://mochitests/content/browser/toolkit/mozapps/extensions/test/browser/browser_install.js | Should be no items in the list - Got 10, expected 1
TEST-UNEXPECTED-FAIL | chrome://mochitests/content/browser/toolkit/mozapps/extensions/test/browser/browser_installssl.js | Test timed out
TEST-UNEXPECTED-FAIL | chrome://mochitests/content/browser/toolkit/mozapps/extensions/test/browser/browser_installssl.js | Should not have seen an install of https://nocert.example.com/browser/toolkit/mozapps/extensions/test/browser/addons/browser_installssl.xpi in state 1
TEST-UNEXPECTED-FAIL | chrome://mochitests/content/browser/toolkit/mozapps/extensions/test/browser/browser_installssl.js | Timed out in the middle of downloading https://nocert.example.com/browser/toolkit/mozapps/extensions/test/browser/addons/browser_installssl.xpi
TEST-UNEXPECTED-FAIL | chrome://mochitests/content/browser/toolkit/mozapps/extensions/test/browser/browser_list.js | Should be nine add-ons installed - Got 18, expected 9
TEST-UNEXPECTED-FAIL | chrome://mochitests/content/browser/toolkit/mozapps/extensions/test/browser/browser_list.js | Add-on 2 should be pending enable - Got 0, expected 1
TEST-UNEXPECTED-FAIL | chrome://mochitests/content/browser/toolkit/mozapps/extensions/test/browser/browser_list.js | Add-on 4 should be pending enable - Got 0, expected 1
TEST-UNEXPECTED-FAIL | chrome://mochitests/content/browser/toolkit/mozapps/extensions/test/browser/browser_list.js | Should be nine add-ons installed - Got 18, expected 9
TEST-UNEXPECTED-FAIL | chrome://mochitests/content/browser/toolkit/mozapps/extensions/test/browser/browser_list.js | Should be nine add-ons installed - Got 18, expected 9
TEST-UNEXPECTED-FAIL | chrome://mochitests/content/browser/toolkit/mozapps/extensions/test/browser/browser_list.js | Focus should have moved to the list - Got null, expected [object XULElement]
TEST-UNEXPECTED-FAIL | chrome://mochitests/content/browser/toolkit/mozapps/extensions/test/browser/browser_list.js | Focus should have moved to the more button - Got [object XULElement], expected [object XULElement]
TEST-UNEXPECTED-FAIL | chrome://mochitests/content/browser/toolkit/mozapps/extensions/test/browser/browser_list.js | Focus should have moved to the disable button - Got [object XULElement], expected [object XULElement]
TEST-UNEXPECTED-FAIL | chrome://mochitests/content/browser/toolkit/mozapps/extensions/test/browser/browser_list.js | Focus should have moved to the remove button - Got [object HTMLInputElement], expected [object XULElement]
TEST-UNEXPECTED-FAIL | chrome://mochitests/content/browser/toolkit/mozapps/extensions/test/browser/browser_list.js | Focus should have moved to the remove button - Got [object HTMLInputElement], expected [object XULElement]
TEST-UNEXPECTED-FAIL | chrome://mochitests/content/browser/toolkit/mozapps/extensions/test/browser/browser_list.js | Focus should have moved to the more button - Got [object XULElement], expected [object XULElement]
TEST-UNEXPECTED-FAIL | chrome://mochitests/content/browser/toolkit/mozapps/extensions/test/browser/browser_list.js | Focus should have moved to the list - Got [object XULElement], expected [object XULElement]
TEST-UNEXPECTED-FAIL | chrome://mochitests/content/browser/toolkit/mozapps/extensions/test/browser/browser_list.js | Focus should be outside the list
TEST-UNEXPECTED-FAIL | chrome://mochitests/content/browser/toolkit/mozapps/extensions/test/browser/browser_list.js | Warning message should not be visible
TEST-UNEXPECTED-FAIL | chrome://mochitests/content/browser/toolkit/mozapps/extensions/test/browser/browser_list.js | Warning message should be correct - Got Addon2 is incompatible with Aurora 18.0a2., expected Test add-on 2 is incompatible with Aurora 18.0a2.
TEST-UNEXPECTED-FAIL | chrome://mochitests/content/browser/toolkit/mozapps/extensions/test/browser/browser_manualupdates.js | Test timed out
TEST-UNEXPECTED-FAIL | chrome://mochitests/content/browser/toolkit/mozapps/extensions/test/browser/browser_manualupdates.js | Found a tab after previous test timed out: about:addons
TEST-UNEXPECTED-FAIL | chrome://mochitests/content/browser/toolkit/mozapps/extensions/test/browser/browser_newaddon.js | Test timed out
TEST-UNEXPECTED-FAIL | chrome://mochitests/content/browser/toolkit/mozapps/extensions/test/browser/browser_purchase.js | Should be 5 results - Got 1, expected 5
TEST-UNEXPECTED-FAIL | chrome://mochitests/content/browser/toolkit/mozapps/extensions/test/browser/browser_purchase.js | Add-on 0 should be in expected position - Got Free Add-on, expected Ludicrously Expensive Add-on
TEST-UNEXPECTED-FAIL | chrome://mochitests/content/browser/toolkit/mozapps/extensions/test/browser/browser_purchase.js | Add-on 0 install button should be hidden
TEST-UNEXPECTED-FAIL | chrome://mochitests/content/browser/toolkit/mozapps/extensions/test/browser/browser_purchase.js | Add-on 0 purchase button should be visible
TEST-UNEXPECTED-FAIL | chrome://mochitests/content/browser/toolkit/mozapps/extensions/test/browser/browser_purchase.js | Add-on 0 should have the right price - Got , expected Purchase for $101…
TEST-UNEXPECTED-FAIL | chrome://mochitests/content/browser/toolkit/mozapps/extensions/test/browser/browser_purchase.js | an unexpected uncaught JS exception reported through window.onerror - TypeError: parent is undefined at chrome://mochitests/content/browser/toolkit/mozapps/extensions/test/browser/browser_purchase.js:53
TEST-UNEXPECTED-FAIL | chrome://mochitests/content/browser/toolkit/mozapps/extensions/test/browser/browser_purchase.js | Test timed out
TEST-UNEXPECTED-FAIL | chrome://mochitests/content/browser/toolkit/mozapps/extensions/test/browser/browser_purchase.js | Should not have seen an install of http://example.com/addon1.xpi in state 0
TEST-UNEXPECTED-FAIL | chrome://mochitests/content/browser/toolkit/mozapps/extensions/test/browser/browser_purchase.js | Found a tab after previous test timed out: about:addons
TEST-UNEXPECTED-FAIL | chrome://mochitests/content/browser/toolkit/mozapps/extensions/test/browser/browser_recentupdates.js | Should get expected item based on sort order - Got addon2@tests.mozilla.org, expected addon1@tests.mozilla.org
TEST-UNEXPECTED-FAIL | chrome://mochitests/content/browser/toolkit/mozapps/extensions/test/browser/browser_recentupdates.js | Should be expecting more items - Didn't expect 0, but got it
TEST-UNEXPECTED-FAIL | chrome://mochitests/content/browser/toolkit/mozapps/extensions/test/browser/browser_recentupdates.js | Should get expected item based on sort order - Got addon3@tests.mozilla.org, expected undefined
TEST-UNEXPECTED-FAIL | chrome://mochitests/content/browser/toolkit/mozapps/extensions/test/browser/browser_recentupdates.js | Should be expecting more items - Didn't expect 0, but got it
TEST-UNEXPECTED-FAIL | chrome://mochitests/content/browser/toolkit/mozapps/extensions/test/browser/browser_recentupdates.js | Should get expected item based on sort order - Got addon1@tests.mozilla.org, expected undefined
TEST-UNEXPECTED-FAIL | chrome://mochitests/content/browser/toolkit/mozapps/extensions/test/browser/browser_recentupdates.js | Should be expecting more items - Didn't expect 0, but got it
TEST-UNEXPECTED-FAIL | chrome://mochitests/content/browser/toolkit/mozapps/extensions/test/browser/browser_recentupdates.js | Should get expected item based on sort order - Got addon3@tests.mozilla.org, expected undefined
TEST-UNEXPECTED-FAIL | chrome://mochitests/content/browser/toolkit/mozapps/extensions/test/browser/browser_recentupdates.js | Should be expecting more items - Didn't expect 0, but got it
TEST-UNEXPECTED-FAIL | chrome://mochitests/content/browser/toolkit/mozapps/extensions/test/browser/browser_recentupdates.js | Should get expected item based on sort order - Got addon2@tests.mozilla.org, expected undefined
TEST-UNEXPECTED-FAIL | chrome://mochitests/content/browser/toolkit/mozapps/extensions/test/browser/browser_recentupdates.js | Should get expected item based on sort order - Got addon3@tests.mozilla.org, expected addon1@tests.mozilla.org
TEST-UNEXPECTED-FAIL | chrome://mochitests/content/browser/toolkit/mozapps/extensions/test/browser/browser_recentupdates.js | Should be expecting more items - Didn't expect 0, but got it
TEST-UNEXPECTED-FAIL | chrome://mochitests/content/browser/toolkit/mozapps/extensions/test/browser/browser_recentupdates.js | Should get expected item based on sort order - Got addon2@tests.mozilla.org, expected undefined
TEST-UNEXPECTED-FAIL | chrome://mochitests/content/browser/toolkit/mozapps/extensions/test/browser/browser_recentupdates.js | Should be expecting more items - Didn't expect 0, but got it
TEST-UNEXPECTED-FAIL | chrome://mochitests/content/browser/toolkit/mozapps/extensions/test/browser/browser_recentupdates.js | Should get expected item based on sort order - Got addon1@tests.mozilla.org, expected undefined
TEST-UNEXPECTED-FAIL | chrome://mochitests/content/browser/toolkit/mozapps/extensions/test/browser/browser_recentupdates.js | Should be expecting more items - Didn't expect 0, but got it
TEST-UNEXPECTED-FAIL | chrome://mochitests/content/browser/toolkit/mozapps/extensions/test/browser/browser_recentupdates.js | Should get expected item based on sort order - Got addon3@tests.mozilla.org, expected undefined
TEST-UNEXPECTED-FAIL | chrome://mochitests/content/browser/toolkit/mozapps/extensions/test/browser/browser_recentupdates.js | Should be expecting more items - Didn't expect 0, but got it
TEST-UNEXPECTED-FAIL | chrome://mochitests/content/browser/toolkit/mozapps/extensions/test/browser/browser_recentupdates.js | Should get expected item based on sort order - Got addon2@tests.mozilla.org, expected undefined
TEST-UNEXPECTED-FAIL | chrome://mochitests/content/browser/toolkit/mozapps/extensions/test/browser/browser_select_compatoverrides.js | Should get expected addon - Got addon10@tests.mozilla.org, expected addon1@tests.mozilla.org
TEST-UNEXPECTED-FAIL | chrome://mochitests/content/browser/toolkit/mozapps/extensions/test/browser/browser_select_compatoverrides.js | Test timed out
TEST-UNEXPECTED-FAIL | chrome://mochitests/content/browser/toolkit/mozapps/extensions/test/browser/browser_select_confirm.js | Incompatible list should be hidden
TEST-UNEXPECTED-FAIL | chrome://mochitests/content/browser/toolkit/mozapps/extensions/test/browser/browser_select_confirm.js | Should be two add-ons waiting to be compatible (plus the header) - Got 11, expected 3
TEST-UNEXPECTED-FAIL | chrome://mochitests/content/browser/toolkit/mozapps/extensions/test/browser/browser_select_confirm.js | Should be the right add-on ID - Got addon10@tests.mozilla.org, expected test1@tests.mozilla.org
TEST-UNEXPECTED-FAIL | chrome://mochitests/content/browser/toolkit/mozapps/extensions/test/browser/browser_select_confirm.js | Should be the right add-on name - Got Addon10, expected Test Add-on 1
TEST-UNEXPECTED-FAIL | chrome://mochitests/content/browser/toolkit/mozapps/extensions/test/browser/browser_select_confirm.js | Should be the right add-on ID - Got addon2@tests.mozilla.org, expected test3@tests.mozilla.org
TEST-UNEXPECTED-FAIL | chrome://mochitests/content/browser/toolkit/mozapps/extensions/test/browser/browser_select_confirm.js | Should be the right add-on name - Got Addon2, expected Test Add-on 3
TEST-UNEXPECTED-FAIL | chrome://mochitests/content/browser/toolkit/mozapps/extensions/test/browser/browser_select_confirm.js | Incompatible list should be hidden
TEST-UNEXPECTED-FAIL | chrome://mochitests/content/browser/toolkit/mozapps/extensions/test/browser/browser_select_selection.js | Test timed out
TEST-UNEXPECTED-FAIL | chrome://mochitests/content/browser/toolkit/mozapps/extensions/test/browser/browser_select_selection.js | Found a after previous test timed out
TEST-UNEXPECTED-FAIL | chrome://mochitests/content/browser/toolkit/mozapps/extensions/test/browser/browser_sorting.js | Should have seen the right order - Got ["addon4@tests.mozilla.org", "test2@tests.mozilla.org", "test4@tests.mozilla.org", "test3@tests.mozilla.org", "test5@tests.mozilla.org", "test1@tests.mozilla.org", "test7@tests.mozilla.org", "test8@tests.mozilla.org", "test6@tests.mozilla.org", "test10@tests.mozilla.org", "test9@tests.mozilla.org", "test11@tests.mozilla.org", "test13@tests.mozilla.org", "test12@tests.mozilla.org", "test14@tests.mozilla.org", "test15@tests.mozilla.org", "addon10@tests.mozilla.org", "addon2@tests.mozilla.org", "addon3@tests.mozilla.org", "addon5@tests.mozilla.org", "addon6@tests.mozilla.org", "addon7@tests.mozilla.org", "addon8@tests.mozilla.org", "addon9@tests.mozilla.org", "test17@tests.mozilla.org", "test19@tests.mozilla.org", "test16@tests.mozilla.org", "test20@tests.mozilla.org", "test18@tests.mozilla.org"], expected ["test2@tests.mozilla.org", "test4@tests.mozilla.org", "test3@tests.mozilla.org", "test5@tests.mozilla.org", "test1@tests.mozilla.org", "test7@tests.mozilla.org", "test8@tests.mozilla.org", "test6@tests.mozilla.org", "test10@tests.mozilla.org", "test9@tests.mozilla.org", "test11@tests.mozilla.org", "test13@tests.mozilla.org", "test12@tests.mozilla.org", "test14@tests.mozilla.org", "test15@tests.mozilla.org", "test17@tests.mozilla.org", "test19@tests.mozilla.org", "test16@tests.mozilla.org", "test20@tests.mozilla.org", "test18@tests.mozilla.org"]
TEST-UNEXPECTED-FAIL | chrome://mochitests/content/browser/toolkit/mozapps/extensions/test/browser/browser_sorting.js | Should have seen the right order - Got ["test5@tests.mozilla.org", "addon4@tests.mozilla.org", "test3@tests.mozilla.org", "test1@tests.mozilla.org", "test2@tests.mozilla.org", "test4@tests.mozilla.org", "test10@tests.mozilla.org", "test9@tests.mozilla.org", "test8@tests.mozilla.org", "test6@tests.mozilla.org", "test7@tests.mozilla.org", "test12@tests.mozilla.org", "test14@tests.mozilla.org", "test15@tests.mozilla.org", "test13@tests.mozilla.org", "test11@tests.mozilla.org", "addon10@tests.mozilla.org", "addon6@tests.mozilla.org", "addon7@tests.mozilla.org", "addon8@tests.mozilla.org", "addon9@tests.mozilla.org", "addon2@tests.mozilla.org", "addon3@tests.mozilla.org", "addon5@tests.mozilla.org", "test20@tests.mozilla.org", "test17@tests.mozilla.org", "test18@tests.mozilla.org", "test19@tests.mozilla.org", "test16@tests.mozilla.org"], expected ["test5@tests.mozilla.org", "test3@tests.mozilla.org", "test1@tests.mozilla.org", "test2@tests.mozilla.org", "test4@tests.mozilla.org", "test10@tests.mozilla.org", "test9@tests.mozilla.org", "test8@tests.mozilla.org", "test6@tests.mozilla.org", "test7@tests.mozilla.org", "test12@tests.mozilla.org", "test14@tests.mozilla.org", "test15@tests.mozilla.org", "test13@tests.mozilla.org", "test11@tests.mozilla.org", "test20@tests.mozilla.org", "test17@tests.mozilla.org", "test18@tests.mozilla.org", "test19@tests.mozilla.org", "test16@tests.mozilla.org"]
TEST-UNEXPECTED-FAIL | chrome://mochitests/content/browser/toolkit/mozapps/extensions/test/browser/browser_sorting.js | Should have seen the right order - Got ["test4@tests.mozilla.org", "test2@tests.mozilla.org", "test1@tests.mozilla.org", "test3@tests.mozilla.org", "addon4@tests.mozilla.org", "test5@tests.mozilla.org", "test7@tests.mozilla.org", "test6@tests.mozilla.org", "test8@tests.mozilla.org", "test9@tests.mozilla.org", "test10@tests.mozilla.org", "test11@tests.mozilla.org", "test13@tests.mozilla.org", "test15@tests.mozilla.org", "test14@tests.mozilla.org", "test12@tests.mozilla.org", "test16@tests.mozilla.org", "test19@tests.mozilla.org", "test18@tests.mozilla.org", "test17@tests.mozilla.org", "test20@tests.mozilla.org", "addon2@tests.mozilla.org", "addon3@tests.mozilla.org", "addon5@tests.mozilla.org", "addon10@tests.mozilla.org", "addon6@tests.mozilla.org", "addon7@tests.mozilla.org", "addon8@tests.mozilla.org", "addon9@tests.mozilla.org"], expected ["test4@tests.mozilla.org", "test2@tests.mozilla.org", "test1@tests.mozilla.org", "test3@tests.mozilla.org", "test5@tests.mozilla.org", "test7@tests.mozilla.org", "test6@tests.mozilla.org", "test8@tests.mozilla.org", "test9@tests.mozilla.org", "test10@tests.mozilla.org", "test11@tests.mozilla.org", "test13@tests.mozilla.org", "test15@tests.mozilla.org", "test14@tests.mozilla.org", "test12@tests.mozilla.org", "test16@tests.mozilla.org", "test19@tests.mozilla.org", "test18@tests.mozilla.org", "test17@tests.mozilla.org", "test20@tests.mozilla.org"]
TEST-UNEXPECTED-FAIL | chrome://mochitests/content/browser/toolkit/mozapps/extensions/test/browser/browser_sorting.js | Should have seen the right order - Got ["addon4@tests.mozilla.org", "test2@tests.mozilla.org", "test4@tests.mozilla.org", "test3@tests.mozilla.org", "test5@tests.mozilla.org", "test1@tests.mozilla.org", "test7@tests.mozilla.org", "test8@tests.mozilla.org", "test6@tests.mozilla.org", "test10@tests.mozilla.org", "test9@tests.mozilla.org", "test11@tests.mozilla.org", "test13@tests.mozilla.org", "test12@tests.mozilla.org", "test14@tests.mozilla.org", "test15@tests.mozilla.org", "addon10@tests.mozilla.org", "addon2@tests.mozilla.org", "addon3@tests.mozilla.org", "addon5@tests.mozilla.org", "addon6@tests.mozilla.org", "addon7@tests.mozilla.org", "addon8@tests.mozilla.org", "addon9@tests.mozilla.org", "test17@tests.mozilla.org", "test19@tests.mozilla.org", "test16@tests.mozilla.org", "test20@tests.mozilla.org", "test18@tests.mozilla.org"], expected ["test2@tests.mozilla.org", "test4@tests.mozilla.org", "test3@tests.mozilla.org", "test5@tests.mozilla.org", "test1@tests.mozilla.org", "test7@tests.mozilla.org", "test8@tests.mozilla.org", "test6@tests.mozilla.org", "test10@tests.mozilla.org", "test9@tests.mozilla.org", "test11@tests.mozilla.org", "test13@tests.mozilla.org", "test12@tests.mozilla.org", "test14@tests.mozilla.org", "test15@tests.mozilla.org", "test17@tests.mozilla.org", "test19@tests.mozilla.org", "test16@tests.mozilla.org", "test20@tests.mozilla.org", "test18@tests.mozilla.org"]
TEST-UNEXPECTED-FAIL | chrome://mochitests/content/browser/toolkit/mozapps/extensions/test/browser/browser_sorting.js | Should have seen the right order - Got ["test1@tests.mozilla.org", "test5@tests.mozilla.org", "test3@tests.mozilla.org", "test4@tests.mozilla.org", "test2@tests.mozilla.org", "addon4@tests.mozilla.org", "test9@tests.mozilla.org", "test10@tests.mozilla.org", "test6@tests.mozilla.org", "test8@tests.mozilla.org", "test7@tests.mozilla.org", "test15@tests.mozilla.org", "test14@tests.mozilla.org", "test12@tests.mozilla.org", "test13@tests.mozilla.org", "test11@tests.mozilla.org", "test18@tests.mozilla.org", "test20@tests.mozilla.org", "test16@tests.mozilla.org", "test19@tests.mozilla.org", "test17@tests.mozilla.org", "addon9@tests.mozilla.org", "addon8@tests.mozilla.org", "addon7@tests.mozilla.org", "addon6@tests.mozilla.org", "addon5@tests.mozilla.org", "addon3@tests.mozilla.org", "addon2@tests.mozilla.org", "addon10@tests.mozilla.org"], expected ["test1@tests.mozilla.org", "test5@tests.mozilla.org", "test3@tests.mozilla.org", "test4@tests.mozilla.org", "test2@tests.mozilla.org", "test9@tests.mozilla.org", "test10@tests.mozilla.org", "test6@tests.mozilla.org", "test8@tests.mozilla.org", "test7@tests.mozilla.org", "test15@tests.mozilla.org", "test14@tests.mozilla.org", "test12@tests.mozilla.org", "test13@tests.mozilla.org", "test11@tests.mozilla.org", "test18@tests.mozilla.org", "test20@tests.mozilla.org", "test16@tests.mozilla.org", "test19@tests.mozilla.org", "test17@tests.mozilla.org"]
TEST-UNEXPECTED-FAIL | chrome://mochitests/content/browser/toolkit/mozapps/extensions/test/browser/browser_uninstalling.js | Add-on should be active
TEST-UNEXPECTED-FAIL | chrome://mochitests/content/browser/toolkit/mozapps/extensions/test/browser/browser_uninstalling.js | Add-on should be active
TEST-UNEXPECTED-FAIL | chrome://mochitests/content/browser/toolkit/mozapps/extensions/test/browser/browser_uninstalling.js | Add-on should be active
TEST-UNEXPECTED-FAIL | chrome://mochitests/content/browser/toolkit/mozapps/extensions/test/browser/browser_uninstalling.js | Add-on should be active
TEST-UNEXPECTED-FAIL | chrome://mochitests/content/browser/toolkit/mozapps/extensions/test/browser/browser_uninstalling.js | Add-on should be active
TEST-UNEXPECTED-FAIL | chrome://mochitests/content/browser/toolkit/mozapps/extensions/test/browser/browser_uninstalling.js | Add-on should be active
TEST-UNEXPECTED-FAIL | chrome://mochitests/content/browser/toolkit/mozapps/extensions/test/browser/browser_uninstalling.js | Add-on should be active
TEST-UNEXPECTED-FAIL | chrome://mochitests/content/browser/toolkit/mozapps/extensions/test/browser/browser_uninstalling.js | Add-on should be active
TEST-UNEXPECTED-FAIL | chrome://mochitests/content/browser/toolkit/mozapps/extensions/test/browser/browser_uninstalling.js | Add-on should be active
TEST-UNEXPECTED-FAIL | chrome://mochitests/content/browser/toolkit/mozapps/extensions/test/browser/browser_uninstalling.js | Add-on should be active
TEST-UNEXPECTED-FAIL | chrome://mochitests/content/browser/toolkit/mozapps/extensions/test/browser/browser_uninstalling.js | Add-on should no longer be installed - Got [object Object], expected null
TEST-UNEXPECTED-FAIL | chrome://mochitests/content/browser/toolkit/mozapps/extensions/test/browser/browser_uninstalling.js | Second add-on should no longer be installed - Got [object Object], expected null
TEST-UNEXPECTED-FAIL | chrome://mochitests/content/browser/toolkit/mozapps/extensions/test/browser/browser_uninstalling.js | Should not have found the add-on in the list - Got [object XULElement], expected null
TEST-UNEXPECTED-FAIL | chrome://mochitests/content/browser/toolkit/mozapps/extensions/test/browser/browser_uninstalling.js | Should not have found the second add-on in the list - Got [object XULElement], expected null
TEST-UNEXPECTED-FAIL | chrome://mochitests/content/browser/toolkit/mozapps/extensions/test/browser/browser_uninstalling.js | Add-on should be active
TEST-UNEXPECTED-FAIL | chrome://mochitests/content/browser/toolkit/mozapps/extensions/test/browser/browser_uninstalling.js | Add-on should no longer be installed - Got [object Object], expected null
TEST-UNEXPECTED-FAIL | chrome://mochitests/content/browser/toolkit/mozapps/extensions/test/browser/browser_uninstalling.js | Second add-on should no longer be installed - Got [object Object], expected null
TEST-UNEXPECTED-FAIL | chrome://mochitests/content/browser/toolkit/mozapps/extensions/test/browser/browser_uninstalling.js | Add-on should no longer be installed - Got [object Object], expected null
TEST-UNEXPECTED-FAIL | chrome://mochitests/content/browser/toolkit/mozapps/extensions/test/browser/browser_uninstalling.js | Second add-on should no longer be installed - Got [object Object], expected null
TEST-UNEXPECTED-FAIL | chrome://mochitests/content/browser/toolkit/mozapps/extensions/test/browser/browser_uninstalling.js | Should not have found the add-on in the list - Got [object XULElement], expected null
TEST-UNEXPECTED-FAIL | chrome://mochitests/content/browser/toolkit/mozapps/extensions/test/browser/browser_uninstalling.js | Should not have found the second add-on in the list - Got [object XULElement], expected null
TEST-UNEXPECTED-FAIL | chrome://mochitests/content/browser/toolkit/mozapps/extensions/test/browser/browser_uninstalling.js | Add-on should be active
TEST-UNEXPECTED-FAIL | chrome://mochitests/content/browser/toolkit/mozapps/extensions/test/browser/browser_uninstalling.js | Add-on should no longer be installed - Got [object Object], expected null
TEST-UNEXPECTED-FAIL | chrome://mochitests/content/browser/toolkit/mozapps/extensions/test/browser/browser_uninstalling.js | Second add-on should no longer be installed - Got [object Object], expected null
TEST-UNEXPECTED-FAIL | chrome://mochitests/content/browser/toolkit/mozapps/extensions/test/browser/browser_updateid.js | Should not show the new version in the list - Got [object XULElement], expected null
TEST-UNEXPECTED-FAIL | chrome://mochitests/content/browser/toolkit/mozapps/extensions/test/browser/browser_updateid.js | Should not show the new version in the list - Got [object XULElement], expected null
TEST-UNEXPECTED-FAIL | chrome://mochitests/content/browser/toolkit/mozapps/extensions/test/browser/browser_updatessl.js | Test timed out
TEST-UNEXPECTED-FAIL | chrome://mochitests/content/browser/toolkit/mozapps/extensions/test/xpinstall/browser_httphash.js | Test timed out
TEST-UNEXPECTED-FAIL | chrome://mochitests/content/browser/toolkit/mozapps/extensions/test/xpinstall/browser_httphash.js | Should be no active installs at the end of the test - Got 1, expected 0
TEST-UNEXPECTED-FAIL | chrome://mochitests/content/browser/toolkit/mozapps/extensions/test/xpinstall/browser_httphash.js | Found a tab after previous test timed out: http://example.com/browser/toolkit/mozapps/extensions/test/xpinstall/installtrigger.html?%7B%22Unsigned%20XPI%22%3A%7B%22URL%22%3A%22https%3A%2F%2Fexample.com%2Fbrowser%2Ftoolkit%2Fmozapps%2Fextensions%2Ftest%2Fxpinstall%2FhashRedirect.sjs%3Fsha1%3A3d0dc22e1f394e159b08aaf5f0f97de4d5c65f4f%7Chttp%3A%2F%2Fexample.com%2Fbrowser%2Ftoolkit%2Fmozapps%2Fextensions%2Ftest%2Fxpinstall%2Funsigned.xpi%22%7D%7D
TEST-UNEXPECTED-FAIL | chrome://mochitests/content/browser/toolkit/mozapps/extensions/test/xpinstall/browser_httphash2.js | Test timed out
TEST-UNEXPECTED-FAIL | chrome://mochitests/content/browser/toolkit/mozapps/extensions/test/xpinstall/browser_httphash2.js | Should be no active installs at the end of the test - Got 1, expected 0
TEST-UNEXPECTED-FAIL | chrome://mochitests/content/browser/toolkit/mozapps/extensions/test/xpinstall/browser_httphash2.js | Found a tab after previous test timed out: http://example.com/browser/toolkit/mozapps/extensions/test/xpinstall/installtrigger.html?%7B%22Unsigned%20XPI%22%3A%7B%22URL%22%3A%22https%3A%2F%2Fexample.com%2Fbrowser%2Ftoolkit%2Fmozapps%2Fextensions%2Ftest%2Fxpinstall%2FhashRedirect.sjs%3Fsha1%3Afoobar%7Chttp%3A%2F%2Fexample.com%2Fbrowser%2Ftoolkit%2Fmozapps%2Fextensions%2Ftest%2Fxpinstall%2Funsigned.xpi%22%7D%7D
TEST-UNEXPECTED-FAIL | chrome://mochitests/content/browser/toolkit/mozapps/extensions/test/xpinstall/browser_httphash3.js | Test timed out
TEST-UNEXPECTED-FAIL | chrome://mochitests/content/browser/toolkit/mozapps/extensions/test/xpinstall/browser_httphash3.js | Should be no active installs at the end of the test - Got 1, expected 0
TEST-UNEXPECTED-FAIL | chrome://mochitests/content/browser/toolkit/mozapps/extensions/test/xpinstall/browser_httphash3.js | Found a tab after previous test timed out: http://example.com/browser/toolkit/mozapps/extensions/test/xpinstall/installtrigger.html?%7B%22Unsigned%20XPI%22%3A%7B%22URL%22%3A%22https%3A%2F%2Fexample.com%2Fbrowser%2Ftoolkit%2Fmozapps%2Fextensions%2Ftest%2Fxpinstall%2FhashRedirect.sjs%3Fsha1%3Afoobar%7Chttp%3A%2F%2Fexample.com%2Fbrowser%2Ftoolkit%2Fmozapps%2Fextensions%2Ftest%2Fxpinstall%2Funsigned.xpi%22%2C%22Hash%22%3A%22sha1%3A3d0dc22e1f394e159b08aaf5f0f97de4d5c65f4f%22%7D%7D
TEST-UNEXPECTED-FAIL | chrome://mochitests/content/browser/toolkit/mozapps/extensions/test/xpinstall/browser_httphash5.js | Test timed out
TEST-UNEXPECTED-FAIL | chrome://mochitests/content/browser/toolkit/mozapps/extensions/test/xpinstall/browser_httphash5.js | Should be no active installs at the end of the test - Got 1, expected 0
TEST-UNEXPECTED-FAIL | chrome://mochitests/content/browser/toolkit/mozapps/extensions/test/xpinstall/browser_httphash5.js | Found a tab after previous test timed out: http://example.com/browser/toolkit/mozapps/extensions/test/xpinstall/installtrigger.html?%7B%22Unsigned%20XPI%22%3A%7B%22URL%22%3A%22https%3A%2F%2Fexample.com%2Fbrowser%2Ftoolkit%2Fmozapps%2Fextensions%2Ftest%2Fxpinstall%2FhashRedirect.sjs%3Fsha1%3A3d0dc22e1f394e159b08aaf5f0f97de4d5c65f4f%7Chttps%3A%2F%2Fexample.com%2Fbrowser%2Ftoolkit%2Fmozapps%2Fextensions%2Ftest%2Fxpinstall%2FhashRedirect.sjs%3Fsha1%3Afoobar%7Chttp%3A%2F%2Fexample.com%2Fbrowser%2Ftoolkit%2Fmozapps%2Fextensions%2Ftest%2Fxpinstall%2Funsigned.xpi%22%7D%7D
TEST-UNEXPECTED-FAIL | chrome://mochitests/content/browser/toolkit/mozapps/extensions/test/xpinstall/browser_httphash6.js | application timed out after 330 seconds with no output
PROCESS-CRASH | chrome://mochitests/content/browser/toolkit/mozapps/extensions/test/xpinstall/browser_httphash6.js | application crashed (minidump found)
Thread 0 (crashed)
Comment 56•13 years ago
|
||
| Comment hidden (Legacy TBPL/Treeherder Robot) |
MarcoZ
https://tbpl.mozilla.org/php/getParsedLog.php?id=16223470&tree=Mozilla-Aurora
Rev3 Fedora 12 mozilla-aurora pgo test mochitest-other on 2012-10-17 22:22:17
slave: talos-r3-fed-048
TEST-UNEXPECTED-FAIL | chrome://mochitests/content/browser/netwerk/test/browser/browser_NetUtil.js | Test timed out
TEST-UNEXPECTED-FAIL | chrome://mochitests/content/browser/toolkit/components/social/test/browser/browser_frameworker.js | Test timed out
TEST-UNEXPECTED-FAIL | chrome://mochitests/content/browser/toolkit/mozapps/extensions/test/browser-window/browser_discovery.js | Test timed out
TEST-UNEXPECTED-FAIL | chrome://mochitests/content/browser/toolkit/mozapps/extensions/test/browser-window/browser_discovery.js | Found unexpected add-ons manager window still open
TEST-UNEXPECTED-FAIL | chrome://mochitests/content/browser/toolkit/mozapps/extensions/test/browser-window/browser_discovery.js | an unexpected uncaught JS exception reported through window.onerror - TypeError: browser.removeProgressListener is not a function at chrome://mochitests/content/browser/toolkit/mozapps/extensions/test/browser-window/browser_discovery.js:174
TEST-UNEXPECTED-FAIL | chrome://mochitests/content/browser/toolkit/mozapps/extensions/test/browser-window/browser_dragdrop.js | an unexpected uncaught JS exception reported through window.onerror - NS_ERROR_FAILURE: Component returned failure code: 0x80004005 (NS_ERROR_FAILURE) [nsIZipReader.open] at chrome://mochikit/content/chrome-harness.js:269
TEST-UNEXPECTED-FAIL | chrome://mochitests/content/browser/toolkit/mozapps/extensions/test/browser-window/browser_dragdrop.js | Test timed out
TEST-UNEXPECTED-FAIL | chrome://mochitests/content/browser/toolkit/mozapps/extensions/test/browser-window/browser_dragdrop.js | Found unexpected add-ons manager window still open
TEST-UNEXPECTED-FAIL | chrome://mochitests/content/browser/toolkit/mozapps/extensions/test/browser/browser_bug567127.js | an unexpected uncaught JS exception reported through window.onerror - NS_ERROR_FAILURE: Component returned failure code: 0x80004005 (NS_ERROR_FAILURE) [nsIZipReader.open] at chrome://mochikit/content/chrome-harness.js:269
TEST-UNEXPECTED-FAIL | chrome://mochitests/content/browser/toolkit/mozapps/extensions/test/browser/browser_bug567127.js | Test timed out
TEST-UNEXPECTED-FAIL | chrome://mochitests/content/browser/toolkit/mozapps/extensions/test/browser/browser_bug567127.js | Found a tab after previous test timed out: about:addons
TEST-UNEXPECTED-FAIL | chrome://mochitests/content/browser/toolkit/mozapps/extensions/test/browser/browser_dragdrop.js | an unexpected uncaught JS exception reported through window.onerror - NS_ERROR_FAILURE: Component returned failure code: 0x80004005 (NS_ERROR_FAILURE) [nsIZipReader.open] at chrome://mochikit/content/chrome-harness.js:269
TEST-UNEXPECTED-FAIL | chrome://mochitests/content/browser/toolkit/mozapps/extensions/test/browser/browser_dragdrop.js | Test timed out
TEST-UNEXPECTED-FAIL | chrome://mochitests/content/browser/toolkit/mozapps/extensions/test/browser/browser_dragdrop.js | Found a tab after previous test timed out: about:addons
TEST-UNEXPECTED-FAIL | chrome://mochitests/content/browser/toolkit/mozapps/extensions/test/browser/browser_select_compatoverrides.js | Test timed out
TEST-UNEXPECTED-FAIL | chrome://mochitests/content/browser/toolkit/mozapps/extensions/test/browser/browser_updatessl.js | Test timed out
TEST-UNEXPECTED-FAIL | chrome://mochitests/content/browser/toolkit/mozapps/extensions/test/xpinstall/browser_httphash.js | Test timed out
TEST-UNEXPECTED-FAIL | chrome://mochitests/content/browser/toolkit/mozapps/extensions/test/xpinstall/browser_httphash.js | Should be no active installs at the end of the test - Got 1, expected 0
TEST-UNEXPECTED-FAIL | chrome://mochitests/content/browser/toolkit/mozapps/extensions/test/xpinstall/browser_httphash.js | Found a tab after previous test timed out: http://example.com/browser/toolkit/mozapps/extensions/test/xpinstall/installtrigger.html?%7B%22Unsigned%20XPI%22%3A%7B%22URL%22%3A%22https%3A%2F%2Fexample.com%2Fbrowser%2Ftoolkit%2Fmozapps%2Fextensions%2Ftest%2Fxpinstall%2FhashRedirect.sjs%3Fsha1%3A3d0dc22e1f394e159b08aaf5f0f97de4d5c65f4f%7Chttp%3A%2F%2Fexample.com%2Fbrowser%2Ftoolkit%2Fmozapps%2Fextensions%2Ftest%2Fxpinstall%2Funsigned.xpi%22%7D%7D
TEST-UNEXPECTED-FAIL | chrome://mochitests/content/browser/toolkit/mozapps/extensions/test/xpinstall/browser_httphash2.js | Test timed out
TEST-UNEXPECTED-FAIL | chrome://mochitests/content/browser/toolkit/mozapps/extensions/test/xpinstall/browser_httphash2.js | Should be no active installs at the end of the test - Got 1, expected 0
TEST-UNEXPECTED-FAIL | chrome://mochitests/content/browser/toolkit/mozapps/extensions/test/xpinstall/browser_httphash2.js | Found a tab after previous test timed out: http://example.com/browser/toolkit/mozapps/extensions/test/xpinstall/installtrigger.html?%7B%22Unsigned%20XPI%22%3A%7B%22URL%22%3A%22https%3A%2F%2Fexample.com%2Fbrowser%2Ftoolkit%2Fmozapps%2Fextensions%2Ftest%2Fxpinstall%2FhashRedirect.sjs%3Fsha1%3Afoobar%7Chttp%3A%2F%2Fexample.com%2Fbrowser%2Ftoolkit%2Fmozapps%2Fextensions%2Ftest%2Fxpinstall%2Funsigned.xpi%22%7D%7D
TEST-UNEXPECTED-FAIL | chrome://mochitests/content/browser/toolkit/mozapps/extensions/test/xpinstall/browser_httphash3.js | Test timed out
TEST-UNEXPECTED-FAIL | chrome://mochitests/content/browser/toolkit/mozapps/extensions/test/xpinstall/browser_httphash3.js | Should be no active installs at the end of the test - Got 1, expected 0
TEST-UNEXPECTED-FAIL | chrome://mochitests/content/browser/toolkit/mozapps/extensions/test/xpinstall/browser_httphash3.js | Found a tab after previous test timed out: http://example.com/browser/toolkit/mozapps/extensions/test/xpinstall/installtrigger.html?%7B%22Unsigned%20XPI%22%3A%7B%22URL%22%3A%22https%3A%2F%2Fexample.com%2Fbrowser%2Ftoolkit%2Fmozapps%2Fextensions%2Ftest%2Fxpinstall%2FhashRedirect.sjs%3Fsha1%3Afoobar%7Chttp%3A%2F%2Fexample.com%2Fbrowser%2Ftoolkit%2Fmozapps%2Fextensions%2Ftest%2Fxpinstall%2Funsigned.xpi%22%2C%22Hash%22%3A%22sha1%3A3d0dc22e1f394e159b08aaf5f0f97de4d5c65f4f%22%7D%7D
TEST-UNEXPECTED-FAIL | chrome://mochitests/content/browser/toolkit/mozapps/extensions/test/xpinstall/browser_httphash5.js | Test timed out
TEST-UNEXPECTED-FAIL | chrome://mochitests/content/browser/toolkit/mozapps/extensions/test/xpinstall/browser_httphash5.js | Should be no active installs at the end of the test - Got 1, expected 0
TEST-UNEXPECTED-FAIL | chrome://mochitests/content/browser/toolkit/mozapps/extensions/test/xpinstall/browser_httphash5.js | Found a tab after previous test timed out: http://example.com/browser/toolkit/mozapps/extensions/test/xpinstall/installtrigger.html?%7B%22Unsigned%20XPI%22%3A%7B%22URL%22%3A%22https%3A%2F%2Fexample.com%2Fbrowser%2Ftoolkit%2Fmozapps%2Fextensions%2Ftest%2Fxpinstall%2FhashRedirect.sjs%3Fsha1%3A3d0dc22e1f394e159b08aaf5f0f97de4d5c65f4f%7Chttps%3A%2F%2Fexample.com%2Fbrowser%2Ftoolkit%2Fmozapps%2Fextensions%2Ftest%2Fxpinstall%2FhashRedirect.sjs%3Fsha1%3Afoobar%7Chttp%3A%2F%2Fexample.com%2Fbrowser%2Ftoolkit%2Fmozapps%2Fextensions%2Ftest%2Fxpinstall%2Funsigned.xpi%22%7D%7D
TEST-UNEXPECTED-FAIL | chrome://mochitests/content/browser/toolkit/mozapps/extensions/test/xpinstall/browser_httphash6.js | application timed out after 330 seconds with no output
PROCESS-CRASH | chrome://mochitests/content/browser/toolkit/mozapps/extensions/test/xpinstall/browser_httphash6.js | application crashed (minidump found)
Thread 0 (crashed)
| Assignee | ||
Updated•13 years ago
|
Keywords: intermittent-failure
| Assignee | ||
Updated•13 years ago
|
Whiteboard: [orange]
Comment 57•13 years ago
|
||
Resolving WFM keyword:intermittent-failure bugs last modified >3 months ago, whose whiteboard contains none of:
{random,disabled,marked,fuzzy,todo,fails,failing,annotated,time-bomb,leave open}
There will inevitably be some false positives; for that (and the bugspam) I apologise. Filter on orangewfm.
Status: NEW → RESOLVED
Closed: 13 years ago
Resolution: --- → WORKSFORME
You need to log in
before you can comment on or make changes to this bug.
Description
•