Intermittent "[make-package-internal] Error 137" from "/bin/sh: line 1: 32258 Killed: 9 python /builds/slave/m-in-osx64-dbg/tools/release/signing/signtool.py" during Mac builds

RESOLVED WORKSFORME

Status

Release Engineering
General
RESOLVED WORKSFORME
6 years ago
5 years ago

People

(Reporter: philor, Unassigned)

Tracking

Firefox Tracking Flags

(Not tracked)

Details

(Reporter)

Description

6 years ago
I, um, I don't have any idea.

https://tbpl.mozilla.org/php/getParsedLog.php?id=14860412&tree=Mozilla-Inbound
OS X 10.7 64-bit mozilla-inbound leak test build on 2012-08-30 20:15:54 PDT for push a4977a26f99d
slave: bld-lion-r5-072

  adding: defaults/preferences/prefs.js (deflated 55%)
Stripped 2382 bytes
Deoptimized 0/27 in ./omni.ja
/bin/sh: line 1: 32258 Killed: 9               python /builds/slave/m-in-osx64-dbg/tools/release/signing/signtool.py --cachedir /builds/slave/m-in-osx64-dbg/signing_cache -t /builds/slave/m-in-osx64-dbg/token -n /builds/slave/m-in-osx64-dbg/nonce -c /builds/slave/m-in-osx64-dbg/tools/release/signing/host.cert -H mac-signing1.srv.releng.scl3.mozilla.com:9100 -H mac-signing2.srv.releng.scl3.mozilla.com:9100 -f dmg --nsscmd "/builds/slave/m-in-osx64-dbg/build/obj-firefox/dist/bin/run-mozilla.sh /builds/slave/m-in-osx64-dbg/build/obj-firefox/browser/installer/../../dist/bin/shlibsign -v -i" FirefoxNightlyDebug.app
make[3]: *** [make-package-internal] Error 137
make[2]: *** [make-package] Error 2
make[1]: *** [default] Error 2
make: *** [package] Error 2
program finished with exit code 2
(Reporter)

Comment 1

6 years ago
And the lines where I should have gone a few further,

elapsedTime=38.563092
========= Finished 'make package' failed (results: 2, elapsed: 38 secs) (at 2012-08-30 20:41:28.501597) =========

Comment 2

5 years ago
No recurrence (so far).
Status: NEW → RESOLVED
Last Resolved: 5 years ago
Resolution: --- → WORKSFORME
(Assignee)

Updated

5 years ago
Product: mozilla.org → Release Engineering
You need to log in before you can comment on or make changes to this bug.