build error in content/xslt/src

RESOLVED WORKSFORME

Status

()

Firefox
Build Config
RESOLVED WORKSFORME
6 years ago
6 years ago

People

(Reporter: Hussam Al-Tayeb, Unassigned)

Tracking

Trunk
x86
Linux
Points:
---

Firefox Tracking Flags

(Not tracked)

Details

(Reporter)

Description

6 years ago
User Agent: Mozilla/5.0 (X11; Linux i686; rv:20.0) Gecko/20100101 Firefox/20.0
Build ID: 20121201152222

Steps to reproduce:

clang++ -o txMozillaXSLTProcessor.o -c -I../../../../dist/stl_wrappers -I../../../../dist/system_wrappers -include /home/hussam/packages/firefox/src/firefox/config/gcc_hidden.h -DMOZ_GLUE_IN_PROGRAM -DMOZILLA_INTERNAL_API -D_IMPL_NS_COM -DEXPORT_XPT_API -DEXPORT_XPTC_API -D_IMPL_NS_GFX -D_IMPL_NS_WIDGET -DIMPL_XREAPI -DIMPL_NS_NET -DIMPL_THEBES  -DSTATIC_EXPORTABLE_JS_API -DNO_NSPR_10_SUPPORT -D_IMPL_NS_LAYOUT -I/home/hussam/packages/firefox/src/firefox/dom/base  -I/home/hussam/packages/firefox/src/firefox/content/xslt/src/xslt -I. -I../../../../dist/include  -I/usr/include/nspr -I/usr/include/nss     -I/home/hussam/packages/firefox/src/firefox/content/xslt/src/xslt -I/home/hussam/packages/firefox/src/firefox/content/xslt/src/xslt/../base -I/home/hussam/packages/firefox/src/firefox/content/xslt/src/xslt/../xml -I/home/hussam/packages/firefox/src/firefox/content/xslt/src/xslt/../xpath -I/home/hussam/packages/firefox/src/firefox/content/xslt/src/xslt/../../../base/src   -fPIC -Qunused-arguments  -pedantic -Qunused-arguments -Wall -Wpointer-arith -Woverloaded-virtual -Werror=return-type -Wtype-limits -Wempty-body -Wno-ctor-dtor-privacy -Wno-overlength-strings -Wno-invalid-offsetof -Wno-variadic-macros -Wno-c++0x-extensions -Wno-extended-offsetof -Wno-unknown-warning-option -Wno-return-type-c-linkage -Wno-mismatched-tags -Wno-long-long -fno-exceptions -fno-strict-aliasing -fno-rtti -ffunction-sections -fdata-sections -fno-exceptions -fshort-wchar -pthread -pipe  -DNDEBUG -DTRIMMED -g -Os -freorder-blocks  -fomit-frame-pointer  -Qunused-arguments  -DMOZILLA_CLIENT -include ../../../../mozilla-config.h -MD -MF .deps/txMozillaXSLTProcessor.o.pp  /home/hussam/packages/firefox/src/firefox/content/xslt/src/xslt/txMozillaXSLTProcessor.cpp
rm -f libtxxslt_s.a 
/home/hussam/packages/firefox/src/firefox/obj-i686-pc-linux-gnu/_virtualenv/bin/python /home/hussam/packages/firefox/src/firefox/config/pythonpath.py -I../../../../config /home/hussam/packages/firefox/src/firefox/config/expandlibs_gen.py --depend .deps/libtxxslt_s.a.desc.pp -o libtxxslt_s.a.desc txNodeSorter.o txXPathResultComparator.o txBufferingHandler.o txExecutionState.o txEXSLTFunctions.o txInstructions.o txOutputFormat.o txRtfHandler.o txStylesheet.o txStylesheetCompileHandlers.o txStylesheetCompiler.o txTextHandler.o txToplevelItems.o txXSLTNumber.o txXSLTNumberCounters.o txPatternOptimizer.o txXSLTPatterns.o txXSLTProcessor.o txPatternParser.o txUnknownHandler.o txCurrentFunctionCall.o txDocumentFunctionCall.o txFormatNumberFunctionCall.o txGenerateIdFunctionCall.o txKeyFunctionCall.o txXSLTEnvironmentFunctionCall.o txMozillaStylesheetCompiler.o txMozillaTextOutput.o txMozillaXMLOutput.o txMozillaXSLTProcessor.o  
/home/hussam/packages/firefox/src/firefox/obj-i686-pc-linux-gnu/_virtualenv/bin/python /home/hussam/packages/firefox/src/firefox/config/buildlist.py ../../../../dist/bin/chrome.manifest "manifest components/txEXSLTRegExFunctions.manifest"
make[8]: Leaving directory `/home/hussam/packages/firefox/src/firefox/obj-i686-pc-linux-gnu/content/xslt/src/xslt'
make[7]: Leaving directory `/home/hussam/packages/firefox/src/firefox/obj-i686-pc-linux-gnu/content/xslt/src'
make[6]: Leaving directory `/home/hussam/packages/firefox/src/firefox/obj-i686-pc-linux-gnu/content/xslt'
make[5]: Leaving directory `/home/hussam/packages/firefox/src/firefox/obj-i686-pc-linux-gnu/content'
make[4]: *** [libs_tier_platform] Error 2
make[4]: Leaving directory `/home/hussam/packages/firefox/src/firefox/obj-i686-pc-linux-gnu'
make[3]: *** [tier_platform] Error 2
make[3]: Leaving directory `/home/hussam/packages/firefox/src/firefox/obj-i686-pc-linux-gnu'
make[2]: *** [default] Error 2
make[2]: Leaving directory `/home/hussam/packages/firefox/src/firefox/obj-i686-pc-linux-gnu'
make[1]: *** [realbuild] Error 2
make[1]: Leaving directory `/home/hussam/packages/firefox/src/firefox'
make: *** [build] Error 2
Component: Untriaged → Build Config
(Reporter)

Comment 1

6 years ago
This appears to have fixed itself after 4 days.
Status: UNCONFIRMED → RESOLVED
Last Resolved: 6 years ago
Resolution: --- → WORKSFORME
You need to log in before you can comment on or make changes to this bug.