Closed Bug 880774 (bld-lion-r5-031) Opened 13 years ago Closed 11 years ago

bld-lion-r5-031 problem tracking

Categories

(Infrastructure & Operations Graveyard :: CIDuty, task, P3)

x86_64
macOS

Tracking

(Not tracked)

RESOLVED FIXED

People

(Reporter: philor, Unassigned)

References

Details

(Whiteboard: [buildduty][buildslaves][capacity])

Attachments

(1 file)

Another one unable to run make check because it can't create a directory in tmpdir.
Disabled in slavealloc.
No longer blocks: 880003
Back in production.
Status: NEW → RESOLVED
Closed: 13 years ago
Resolution: --- → FIXED
Product: mozilla.org → Release Engineering
(In reply to Phil Ringnalda (:philor) from comment #0) > Another one unable to run make check because it can't create a directory in > tmpdir. Happening again; disabled in slavealloc.
Status: RESOLVED → REOPENED
Resolution: FIXED → ---
Just to clarify, doesn't need a reimage, just needs the tmpdir emptying.
Depends on: 880003
Cleaned up and rebooted into production.
Status: REOPENED → RESOLVED
Closed: 13 years ago → 13 years ago
Resolution: --- → FIXED
netboot-reimaged and rebooted+enabled
Status: REOPENED → RESOLVED
Closed: 13 years ago → 12 years ago
No longer depends on: 880003
Resolution: --- → FIXED
See Also: → 880003
Attempting SSH reboot...Failed. Attempting PDU reboot...Failed. Filed IT bug for reboot (bug 1083370)
Status: RESOLVED → REOPENED
Resolution: FIXED → ---
Status: REOPENED → RESOLVED
Closed: 12 years ago → 11 years ago
Resolution: --- → FIXED
No longer blocks: 874642
Attempting SSH reboot...Failed. Attempting PDU reboot...Failed. Filed IT bug for reboot (bug 1114269)
Status: RESOLVED → REOPENED
Resolution: FIXED → ---
TCW false alarm
Status: REOPENED → RESOLVED
Closed: 11 years ago → 11 years ago
Resolution: --- → FIXED
seems this slave has a high rate of failed builds like 06:12:10 INFO - /builds/slave/try-osx64-00000000000000000000/build/src/obj-firefox/i386/dist/test-stage/jsreftest/tests/ecma_5/Global/decodeURI-decodes-FFFE-FFFF.js 06:12:10 INFO - make[2]: *** [postflight_all] Error 1 06:12:10 INFO - make[1]: *** [realbuild] Error 2 06:12:10 INFO - make: *** [build] Error 2 06:12:10 INFO - 441 compiler warnings present. 06:12:12 INFO - Notification center failed: Install terminal-notifier to get a notification when the build finishes. 06:12:12 ERROR - Return code: 2 06:12:12 FATAL - 'mach build' did not run successfully. Please check log for errors disabled in slave alloc - maybe someone could take a look.
Status: RESOLVED → REOPENED
Resolution: FIXED → ---
It's a try slave, a high rate of failure is expected. No part of what you copy-pasted is either the actual failure, or particularly indicative of an infra failure. Reenabled until it fails in some infra-like way.
Status: REOPENED → RESOLVED
Closed: 11 years ago → 11 years ago
Resolution: --- → FIXED
Status: RESOLVED → REOPENED
Resolution: FIXED → ---
Depends on: 1145810
Reenabled with a new disk.
Status: REOPENED → RESOLVED
Closed: 11 years ago → 11 years ago
Resolution: --- → FIXED
Attempting SSH reboot...Failed. Attempting PDU reboot...Failed. Filed IT bug for reboot (bug 1160564)
Status: RESOLVED → REOPENED
Resolution: FIXED → ---
Disabled.
Removed from inventory & decomm'd. Asking for next steps.
Attachment #8607635 - Flags: review?(bugspam.Callek) → review+
Status: REOPENED → RESOLVED
Closed: 11 years ago → 11 years ago
Resolution: --- → FIXED
Product: Release Engineering → Infrastructure & Operations
Product: Infrastructure & Operations → Infrastructure & Operations Graveyard
You need to log in before you can comment on or make changes to this bug.

Attachment

General

Created:
Updated:
Size: