Intermittent TEST-UNEXPECTED-FAIL | test_DownloadLegacy.js | test failed (with xpcshell return code: 3), see following log | promise.js | Unexpected exception NS_ERROR_FAILURE: 0x80004005 [nsIWebBrowserPersist.savePrivacyAwareURI]

RESOLVED WORKSFORME

Status

()

Toolkit
Downloads API
RESOLVED WORKSFORME
5 years ago
4 years ago

People

(Reporter: KWierso, Unassigned)

Tracking

(Blocks: 1 bug, {intermittent-failure})

Firefox Tracking Flags

(Not tracked)

Details

(Reporter)

Description

5 years ago
https://tbpl.mozilla.org/php/getParsedLog.php?id=28174622&tree=Mozilla-Inbound
using slave: t-xp32-ix-027


15:19:17     INFO -  TEST-INFO | C:\slave\test\build\tests\xpcshell\tests\toolkit\components\jsdownloads\test\unit\test_DownloadLegacy.js | running test ...
15:19:19  WARNING -  TEST-UNEXPECTED-FAIL | C:\slave\test\build\tests\xpcshell\tests\toolkit\components\jsdownloads\test\unit\test_DownloadLegacy.js | test failed (with xpcshell return code: 3), see following log:
15:19:19     INFO -  >>>>>>>
...
15:19:19     INFO -  TEST-INFO | C:/slave/test/build/tests/xpcshell/tests/toolkit/components/jsdownloads/test/unit/test_DownloadLegacy.js | Starting test_error_source
15:19:19     INFO -  TEST-INFO | (xpcshell/head.js) | test test_error_source pending (2)
15:19:19     INFO -  TEST-PASS | C:/slave/test/build/tests/xpcshell/tests/toolkit/components/jsdownloads/test/unit/head.js | [getTempFile : 133] false == false
15:19:19  WARNING -  TEST-UNEXPECTED-FAIL | resource://gre/modules/commonjs/sdk/core/promise.js | Unexpected exception NS_ERROR_FAILURE: Component returned failure code: 0x80004005 (NS_ERROR_FAILURE) [nsIWebBrowserPersist.savePrivacyAwareURI]
15:19:19     INFO -  TEST-INFO | (xpcshell/head.js) | exiting test
...
15:19:19     INFO -  A coding exception was thrown and uncaught in a Task.
15:19:19     INFO -  Full message: TypeError: FileUtils is undefined
15:19:19     INFO -  Full stack: test_error_target@C:/slave/test/build/tests/xpcshell/tests/toolkit/components/jsdownloads/test/unit/test_DownloadLegacy.js -> file:///C:/slave/test/build/tests/xpcshell/tests/toolkit/components/jsdownloads/test/unit/common_test_Download.js:1082
15:19:19     INFO -  TaskImpl_run@resource://gre/modules/Task.jsm:234
15:19:19     INFO -  reject@resource://gre/modules/commonjs/sdk/core/promise.js:133
15:19:19     INFO -  reject@resource://gre/modules/commonjs/sdk/core/promise.js:133
15:19:19     INFO -  then@resource://gre/modules/commonjs/sdk/core/promise.js:52
15:19:19     INFO -  resolve@resource://gre/modules/commonjs/sdk/core/promise.js:185
15:19:19     INFO -  reject@resource://gre/modules/commonjs/sdk/core/promise.js:208
15:19:19     INFO -  TaskImpl_handleException@resource://gre/modules/Task.jsm:299
15:19:19     INFO -  TaskImpl_run@resource://gre/modules/Task.jsm:245
15:19:19     INFO -  reject@resource://gre/modules/commonjs/sdk/core/promise.js:133
15:19:19     INFO -  then@resource://gre/modules/commonjs/sdk/core/promise.js:52
15:19:19     INFO -  resolve@resource://gre/modules/commonjs/sdk/core/promise.js:185
15:19:19     INFO -  reject@resource://gre/modules/commonjs/sdk/core/promise.js:208
15:19:19     INFO -  TaskImpl_handleException@resource://gre/modules/Task.jsm:299
15:19:19     INFO -  TaskImpl_run@resource://gre/modules/Task.jsm:245
15:19:19     INFO -  reject@resource://gre/modules/commonjs/sdk/core/promise.js:133
15:19:19     INFO -  then@resource://gre/modules/commonjs/sdk/core/promise.js:52
15:19:19     INFO -  resolve@resource://gre/modules/commonjs/sdk/core/promise.js:185
15:19:19     INFO -  reject@resource://gre/modules/commonjs/sdk/core/promise.js:208
15:19:19     INFO -  DLS_onTransferFinished@resource://gre/modules/DownloadCore.jsm:1808
15:19:19     INFO -  DLT_OSC_onDownload@resource://gre/components/DownloadLegacy.js:152
15:19:19     INFO -  resolve@resource://gre/modules/commonjs/sdk/core/promise.js:118
15:19:19     INFO -  then@resource://gre/modules/commonjs/sdk/core/promise.js:43
15:19:19     INFO -  then@resource://gre/modules/commonjs/sdk/core/promise.js:153
15:19:19     INFO -  DLT_onStatusChange@resource://gre/components/DownloadLegacy.js:151
15:19:19     INFO -  !!! error running onStopped callback: TypeError: callback is not a function
15:19:19     INFO -  <<<<<<<
Comment hidden (Treeherder Robot)
Comment hidden (Treeherder Robot)
Comment hidden (Treeherder Robot)
Comment hidden (Treeherder Robot)
Comment hidden (Treeherder Robot)
Comment hidden (Treeherder Robot)
Comment hidden (Treeherder Robot)
Paolo, can you take a look please? :)
Flags: needinfo?(paolo.mozmail)

Comment 9

5 years ago
This might be a side-effect of bug 920017, that has a patch awaiting review. If that does not fix it, we can investigate further.
Blocks: 825588
Depends on: 920017
Flags: needinfo?(paolo.mozmail)
Blocks: 921154
Comment hidden (Treeherder Robot)
Comment hidden (Treeherder Robot)
Comment hidden (Treeherder Robot)
Comment hidden (Treeherder Robot)
Comment hidden (Treeherder Robot)
Comment hidden (Treeherder Robot)
Comment hidden (Treeherder Robot)
Comment hidden (Treeherder Robot)
Comment hidden (Treeherder Robot)
Comment hidden (Treeherder Robot)
Closing bugs where TBPLbot has previously commented, but have now not been modified for >3 months & do not contain the whiteboard strings for disabled/annotated tests or use the keyword leave-open. Filter on: mass-intermittent-bug-closure-2014-07
Status: NEW → RESOLVED
Last Resolved: 4 years ago
Resolution: --- → WORKSFORME
You need to log in before you can comment on or make changes to this bug.