Intermittent test_0185_fileInUse_xp_win_partial.js | test failed (with xpcshell return code: 0), see following log:, | exception thrown from do_timeout callback: [Exception... "Component returned failure code: 0x8052000e (NS_ERROR_FILE_IS_LOCKED) [nsIFile

RESOLVED WORKSFORME

Status

()

Toolkit
Application Update
RESOLVED WORKSFORME
5 years ago
4 years ago

People

(Reporter: philor, Unassigned)

Tracking

({intermittent-failure})

Trunk
x86
Windows 7
intermittent-failure
Points:
---

Firefox Tracking Flags

(Not tracked)

Details

(Reporter)

Description

5 years ago
+++ This bug was initially created as a clone of Bug #913866 +++

https://tbpl.mozilla.org/php/getParsedLog.php?id=28733665&tree=Mozilla-Inbound
Windows 7 32-bit mozilla-inbound debug test xpcshell on 2013-10-03 20:58:09 PDT for push a70ad9d7e0f4
slave: t-w732-ix-127

21:43:00  WARNING -  TEST-UNEXPECTED-FAIL | C:\slave\test\build\tests\xpcshell\tests\toolkit\mozapps\update\test\unit\test_0185_fileInUse_xp_win_partial.js | test failed (with xpcshell return code: 0), see following log:
21:43:00     INFO -  >>>>>>>
21:43:00     INFO -  TEST-INFO | (xpcshell/head.js) | test MAIN run_test pending (1)
21:43:00     INFO -  TEST-INFO | (xpcshell/head.js) | test pending (2)
21:43:00     INFO -  21:42:19:298 | TEST-INFO | C:/slave/test/build/tests/xpcshell/tests/toolkit/mozapps/update/test/unit/head_update.js | [setupUpdaterTest : 2095] testing successful removal of the directory used to apply the mar file
21:43:00     INFO -  TEST-PASS | C:/slave/test/build/tests/xpcshell/tests/toolkit/mozapps/update/test/unit/head_update.js | [setupUpdaterTest : 2097] false == false
21:43:00     INFO -  TEST-INFO | (xpcshell/head.js) | test MAIN run_test finished (2)
21:43:00     INFO -  TEST-INFO | (xpcshell/head.js) | running event loop
21:43:00     INFO -  21:42:19:501 | TEST-INFO | C:/slave/test/build/tests/xpcshell/tests/toolkit/mozapps/update/test/unit/head_update.js | [runUpdate : 1593] Running the updater: C:\slave\test\build\tests\xpcshell\tests\toolkit\mozapps\update\test\unit\0185_mar\updater.exe C:\slave\test\build\tests\xpcshell\tests\toolkit\mozapps\update\test\unit\0185_mar C:\slave\test\build\tests\xpcshell\tests\toolkit\mozapps\update\test\unit\0185_applyToDir\appdir\updated\ -1
21:43:00     INFO -  21:42:19:851 | TEST-INFO | C:/slave/test/build/tests/xpcshell/tests/toolkit/mozapps/update/test/unit/test_0185_fileInUse_xp_win_partial.js | [doUpdate : 219] testing updater binary process exitValue for success when applying a complete mar
21:43:00     INFO -  TEST-PASS | C:/slave/test/build/tests/xpcshell/tests/toolkit/mozapps/update/test/unit/test_0185_fileInUse_xp_win_partial.js | [doUpdate : 221] 0 == 0
21:43:00     INFO -  21:42:19:851 | TEST-INFO | C:/slave/test/build/tests/xpcshell/tests/toolkit/mozapps/update/test/unit/test_0185_fileInUse_xp_win_partial.js | [doUpdate : 223] testing update.status should be applied
21:43:00     INFO -  TEST-PASS | C:/slave/test/build/tests/xpcshell/tests/toolkit/mozapps/update/test/unit/test_0185_fileInUse_xp_win_partial.js | [doUpdate : 225] "applied" == "applied"
21:43:00  WARNING -  TEST-UNEXPECTED-FAIL | C:\slave\test\build\tests\xpcshell\head.js | exception thrown from do_timeout callback: [Exception... "Component returned failure code: 0x8052000e (NS_ERROR_FILE_IS_LOCKED) [nsIFile.copyTo]"  nsresult: "0x8052000e (NS_ERROR_FILE_IS_LOCKED)"  location: "JS frame :: C:/slave/test/build/tests/xpcshell/tests/toolkit/mozapps/update/test/unit/head_update.js :: runUpdate :: line 1535"  data: no] - See following stack:
21:43:00     INFO -  JS frame :: C:\slave\test\build\tests\xpcshell\head.js :: _Timer.prototype.notify :: line 150
21:43:00     INFO -  native frame :: <unknown filename> :: <TOP_LEVEL> :: line 0
21:43:00     INFO -  TEST-INFO | (xpcshell/head.js) | exiting test
21:43:00     INFO -  Unable to remove directory
21:43:00     INFO -  path: C:\slave\test\build\tests\xpcshell\tests\toolkit\mozapps\update\test\unit\0185_mar
21:43:00     INFO -  Exception: [Exception... "Component returned failure code: 0x80520015 (NS_ERROR_FILE_ACCESS_DENIED) [nsIFile.isDirectory]"  nsresult: "0x80520015 (NS_ERROR_FILE_ACCESS_DENIED)"  location: "JS frame :: C:/slave/test/build/tests/xpcshell/tests/toolkit/mozapps/update/test/unit/head_update.js :: removeDirRecursive :: line 1165"  data: no]
21:43:00     INFO -  removeDirRecursive: unable to remove file
21:43:00     INFO -  path: C:\slave\test\build\tests\xpcshell\tests\toolkit\mozapps\update\test\unit\0185_applyToDir\appdir\a\b\0\0exe0.exe
21:43:00     INFO -  Exception: [Exception... "Component returned failure code: 0x80520015 (NS_ERROR_FILE_ACCESS_DENIED) [nsIFile.remove]"  nsresult: "0x80520015 (NS_ERROR_FILE_ACCESS_DENIED)"  location: "JS frame :: C:/slave/test/build/tests/xpcshell/tests/toolkit/mozapps/update/test/unit/head_update.js :: removeDirRecursive :: line 1171"  data: no]
21:43:00     INFO -  Unable to remove directory
21:43:00     INFO -  path: C:\slave\test\build\tests\xpcshell\tests\toolkit\mozapps\update\test\unit\0185_applyToDir
21:43:00     INFO -  Exception: [Exception... "Component returned failure code: 0x80520015 (NS_ERROR_FILE_ACCESS_DENIED) [nsIFile.remove]"  nsresult: "0x80520015 (NS_ERROR_FILE_ACCESS_DENIED)"  location: "JS frame :: C:/slave/test/build/tests/xpcshell/tests/toolkit/mozapps/update/test/unit/head_update.js :: removeDirRecursive :: line 1171"  data: no]
21:43:00     INFO -  21:42:20:489 | TEST-INFO | C:/slave/test/build/tests/xpcshell/tests/toolkit/mozapps/update/test/unit/head_update.js | [cleanUp : 1297] start - general test cleanup
21:43:00     INFO -  21:42:20:538 | TEST-INFO | C:/slave/test/build/tests/xpcshell/tests/toolkit/mozapps/update/test/unit/head_update.js | [cleanUp : 1328] finish - general test cleanup
21:43:00     INFO -  removeDirRecursive: unable to remove file
21:43:00     INFO -  path: C:\slave\test\build\tests\xpcshell\tests\toolkit\mozapps\update\test\unit\0185_applyToDir\appdir\a\b\0\0exe0.exe
21:43:00     INFO -  Exception: [Exception... "Component returned failure code: 0x80520015 (NS_ERROR_FILE_ACCESS_DENIED) [nsIFile.remove]"  nsresult: "0x80520015 (NS_ERROR_FILE_ACCESS_DENIED)"  location: "JS frame :: C:/slave/test/build/tests/xpcshell/tests/toolkit/mozapps/update/test/unit/head_update.js :: removeDirRecursive :: line 1171"  data: no]
21:43:00     INFO -  Unable to remove directory
21:43:00     INFO -  path: C:\slave\test\build\tests\xpcshell\tests\toolkit\mozapps\update\test\unit\0185_applyToDir
21:43:00     INFO -  Exception: [Exception... "Component returned failure code: 0x80520015 (NS_ERROR_FILE_ACCESS_DENIED) [nsIFile.remove]"  nsresult: "0x80520015 (NS_ERROR_FILE_ACCESS_DENIED)"  location: "JS frame :: C:/slave/test/build/tests/xpcshell/tests/toolkit/mozapps/update/test/unit/head_update.js :: removeDirRecursive :: line 1171"  data: no]
21:43:00     INFO -  System JS : WARNING C:/slave/test/build/tests/xpcshell/tests/toolkit/mozapps/update/test/unit/head_update.js:1426
21:43:00     INFO -                       in strict mode code, functions may be declared only at top level or immediately within another function
21:43:00     INFO -  System JS : WARNING C:/slave/test/build/tests/xpcshell/tests/toolkit/mozapps/update/test/unit/head_update.js:1429
21:43:00     INFO -                       octal literals and octal escape sequences are deprecated
This hasn't happened for over 3 months and there have been 2 major test rewrites in the interim so resolving WFM. Please file a new bug if something similar happens again. Thanks!
Status: NEW → RESOLVED
Last Resolved: 4 years ago
Resolution: --- → WORKSFORME
You need to log in before you can comment on or make changes to this bug.