Closed Bug 923862 Opened 7 years ago Closed 7 years ago

Clang plugin build failure: [build/clang-plugin/binaries] No rule to make target `binaries'. Stop.

Categories

(Firefox Build System :: General, defect)

x86_64
Linux
defect
Not set

Tracking

(Not tracked)

RESOLVED FIXED
mozilla27

People

(Reporter: alex_y_xu, Assigned: glandium)

References

Details

Attachments

(1 file)

0:02.07 Adding configure options from /home/alex/mozilla-central/.mozconfig:
 0:02.07   --enable-application=browser
 0:02.07   --enable-optimize=-O2
 0:02.07   --with-ccache
 0:02.07   --disable-tests
 0:02.07   --enable-gstreamer
 0:02.07   --enable-system-sqlite
 0:02.07   --with-system-libvpx
 0:02.07   --with-pthreads
 0:02.07   --with-arch=native
 0:02.07   --enable-official-branding
 0:02.07   --disable-accessibility
 0:02.07   --disable-dbus
 0:02.07   --disable-gconf
 0:02.07   --disable-gio
 0:02.07   --disable-necko-wifi
 0:02.07   --disable-parental-controls
 0:02.07   --disable-safe-browsing
 0:02.07   --disable-websms-backend
 0:02.07   --enable-debug-symbols
 0:02.07   --disable-install-strip
 0:02.07   --enable-clang-plugin
 0:02.07   --enable-warnings-as-errors
 0:02.07   --disable-crashreporter
 0:02.07   --disable-updater
[ ... ]
19:29.25 firefox
19:30.19 gmake[6]: *** No rule to make target `binaries'.  Stop.
19:30.27 gmake[5]: *** [build/clang-plugin/binaries] Error 2
19:30.27 gmake[4]: *** [recurse_libs] Error 2
19:30.28 gmake[3]: *** [libs] Error 2
19:30.28 gmake[2]: *** [default] Error 2
19:30.28 gmake[1]: *** [realbuild] Error 2
19:30.28 gmake: *** [build] Error 2
While the bug is legit, I doubt you're using --enable-clang-plugin for the good reason.
Probably not.

My understanding is that it does static analysis checks of the code.

When I think about it though, it seems plausible that it does not *do*, but allows better static analysis; I haven't turned on static analysis intentionally, though (aside from that option), so it may do nothing.
Attachment #813924 - Flags: review?(Pidgeot18)
Attachment #813924 - Flags: review?(Pidgeot18) → review+
Assignee: nobody → mh+mozilla
https://hg.mozilla.org/mozilla-central/rev/05266767e532
Status: UNCONFIRMED → RESOLVED
Closed: 7 years ago
Resolution: --- → FIXED
Target Milestone: --- → mozilla27
Depends on: 926010
Product: Core → Firefox Build System
You need to log in before you can comment on or make changes to this bug.