Intermittent TEST-UNEXPECTED-FAIL | js/src/jit-test/tests/arrow-functions/prototype-2.js

RESOLVED WORKSFORME

Status

()

Core
JavaScript Engine: JIT
RESOLVED WORKSFORME
4 years ago
4 years ago

People

(Reporter: Tomcat, Unassigned)

Tracking

({intermittent-failure})

Trunk
x86
Linux
intermittent-failure
Points:
---

Firefox Tracking Flags

(Not tracked)

Details

(URL)

(Reporter)

Description

4 years ago
b2g_mozilla-inbound_linux64_gecko build on 2013-10-16 13:13:45 PDT for push 6eec00ce4193

slave: bld-linux64-ec2-393

https://tbpl.mozilla.org/php/getParsedLog.php?id=29214043&tree=Mozilla-Inbound

TEST-UNEXPECTED-FAIL | js/src/jit-test/tests/arrow-functions/prototype-2.js | 
make[1]: *** [check-jit-test] Error 2
make: *** [check] Error 2
Comment hidden (Treeherder Robot)
(Reporter)

Updated

4 years ago
Summary: Intermittent TEST-UNEXPECTED-FAIL | js/src/jit-test/tests/arrow-functions/prototype-2.js | make[1]: *** [check-jit-test] Error 2 → Intermittent TEST-UNEXPECTED-FAIL | js/src/jit-test/tests/arrow-functions/prototype-2.js

Comment 2

4 years ago
Closing bugs where TBPLbot has previously commented, but have now not been modified for >3 months & do not contain the whiteboard strings for disabled/annotated tests or use the keyword leave-open. Filter on: mass-intermittent-bug-closure-2014-07
Status: NEW → RESOLVED
Last Resolved: 4 years ago
Resolution: --- → WORKSFORME
You need to log in before you can comment on or make changes to this bug.