If you think a bug might affect users in the 57 release, please set the correct tracking and status flags for Release Management.

OSX bustage from bug 895047

RESOLVED FIXED in Thunderbird 27.0

Status

Thunderbird
General
--
blocker
RESOLVED FIXED
4 years ago
4 years ago

People

(Reporter: RyanVM, Assigned: Ehsan)

Tracking

unspecified
Thunderbird 27.0
x86_64
Mac OS X

Firefox Tracking Flags

(Not tracked)

Details

(Reporter)

Description

4 years ago
https://tbpl.mozilla.org/php/getParsedLog.php?id=29254886&tree=Thunderbird-Trunk

TB OS X 10.7 comm-central build on 2013-10-17 07:45:19 PDT for push b6caffee2274
slave: bld-lion-r5-044

nsMsgRDFUtils.cpp
../../../../../mailnews/addrbook/src/nsAbOSXDirectory.mm:314:73: error: cannot initialize a parameter of type 'const unichar *' (aka 'const unsigned short *') with an rvalue of type 'const char_type *' (aka 'const char16_t *')
                                   value:[NSString stringWithCharacters:value.get() length:length]
                                                                        ^~~~~~~~~~~
/Developer/SDKs/MacOSX10.6.sdk/System/Library/Frameworks/Foundation.framework/Headers/NSString.h:289:45: note: passing argument to parameter 'characters' here
+ (id)stringWithCharacters:(const unichar *)characters length:(NSUInteger)length;
                                            ^
../../../../../mailnews/addrbook/src/nsAbOSXDirectory.mm:326:71: error: cannot initialize a parameter of type 'const unichar *' (aka 'const unsigned short *') with an rvalue of type 'const char_type *' (aka 'const char16_t *')
                                 value:[NSString stringWithCharacters:value.get() length:length]
                                                                      ^~~~~~~~~~~
/Developer/SDKs/MacOSX10.6.sdk/System/Library/Frameworks/Foundation.framework/Headers/NSString.h:289:45: note: passing argument to parameter 'characters' here
+ (id)stringWithCharacters:(const unichar *)characters length:(NSUInteger)length;
                                            ^
../../../../../mailnews/addrbook/src/nsAbOSXDirectory.mm:332:73: error: cannot initialize a parameter of type 'const unichar *' (aka 'const unsigned short *') with an rvalue of type 'const char_type *' (aka 'const char16_t *')
                                   value:[NSString stringWithCharacters:value.get() length:length]
                                                                        ^~~~~~~~~~~
/Developer/SDKs/MacOSX10.6.sdk/System/Library/Frameworks/Foundation.framework/Headers/NSString.h:289:45: note: passing argument to parameter 'characters' here
+ (id)stringWithCharacters:(const unichar *)characters length:(NSUInteger)length;
                                            ^
../../../../../mailnews/addrbook/src/nsAbOSXDirectory.mm:338:72: error: cannot initialize a parameter of type 'const unichar *' (aka 'const unsigned short *') with an rvalue of type 'const char_type *' (aka 'const char16_t *')
                                  value:[NSString stringWithCharacters:value.get() length:length]
                                                                       ^~~~~~~~~~~
/Developer/SDKs/MacOSX10.6.sdk/System/Library/Frameworks/Foundation.framework/Headers/NSString.h:289:45: note: passing argument to parameter 'characters' here
+ (id)stringWithCharacters:(const unichar *)characters length:(NSUInteger)length;
                                            ^
4 errors generated.
make[10]: *** [nsAbOSXDirectory.o] Error 1
make[9]: *** [src_libs] Error 2
make[8]: *** [libs] Error 2
make[7]: *** [addrbook_libs] Error 2

Closed c-c again.
Landed a fix: https://hg.mozilla.org/comm-central/rev/2172e44b2890
Assignee: nobody → ehsan
Status: NEW → RESOLVED
Last Resolved: 4 years ago
Resolution: --- → FIXED
Needed one last touch: https://hg.mozilla.org/comm-central/rev/2e02d7d82639
Target Milestone: --- → Thunderbird 27.0
You need to log in before you can comment on or make changes to this bug.