Closed Bug 947539 Opened 9 years ago Closed 8 years ago

Intermittent TEST-UNEXPECTED-FAIL | parallel/get-3.js | --ion-eager --ion-check-range-analysis --no-sse3

Categories

(Core :: JavaScript Engine: JIT, defect)

x86_64
macOS
defect
Not set
normal

Tracking

()

RESOLVED WONTFIX

People

(Reporter: KWierso, Unassigned)

References

Details

(Keywords: intermittent-failure)

https://tbpl.mozilla.org/php/getParsedLog.php?id=31586973&tree=Mozilla-Inbound
slave: bld-lion-r5-003


TEST-PASS | js/src/jit-test/tests/parallel/get-1.js | --baseline-eager
TEST-PASS | js/src/jit-test/tests/parallel/get-3.js | 
TEST-PASS | js/src/jit-test/tests/parallel/get-3.js | --ion-eager
TEST-PASS | js/src/jit-test/tests/parallel/get-2.js | --ion-eager
FAIL - parallel/get-3.js
TEST-UNEXPECTED-FAIL | js/src/jit-test/tests/parallel/get-3.js | --ion-eager --ion-check-range-analysis --no-sse3
INFO exit-status     : -9
INFO timed-out       : False
INFO stdout          > 
INFO stderr         2> 
TEST-PASS | js/src/jit-test/tests/parallel/get-2.js | --baseline-eager
TEST-PASS | js/src/jit-test/tests/parallel/get-2.js | --baseline-eager --no-ti --no-fpu
TEST-PASS | js/src/jit-test/tests/parallel/get-2.js | --no-baseline --no-ion


TEST-PASS | js/src/jit-test/tests/v8-v5/check-splay.js | --no-baseline --no-ion --no-ti
TEST-PASS | js/src/jit-test/tests/v8-v5/check-splay.js | --no-baseline --no-ion
FAILURES:
    --ion-eager --ion-check-range-analysis --no-sse3 /builds/slave/m-in-osx64-0000000000000000000/build/js/src/jit-test/tests/parallel/get-3.js
TIMEOUTS:
Result summary:
Passed: 27831
Failed: 1
make[1]: *** [check-jit-test] Error 2
make[1]: Target `check' not remade because of errors.
make: *** [check] Error 2
Blocks: PJS
Status: NEW → RESOLVED
Closed: 8 years ago
Resolution: --- → WONTFIX
You need to log in before you can comment on or make changes to this bug.