Closed Bug 951179 Opened 6 years ago Closed 6 years ago

[Rocketbar] Gaia ui tests failing for E.me launch

Categories

(Firefox OS Graveyard :: Gaia::System, defect)

x86
macOS
defect
Not set

Tracking

(Not tracked)

RESOLVED FIXED
1.3 C1/1.4 S1(20dec)

People

(Reporter: kgrandon, Assigned: kgrandon)

References

Details

(Whiteboard: [c= p=2 s=2013.12.20 u=])

Attachments

(1 file)

46 bytes, text/x-github-pull-request
amirn
: review+
Details | Review
FAILED TESTS

-------

test_everythingme_launch_packaged_app.py test_everythingme_launch_packaged_app.TestEverythingMeSearchPanel.test_launch_packaged_app_from_search_panel

(test_everythingme_launch_packaged_app.TestEverythingMeSearchPanel)

Launch packaged app from homescreen search panel. ... ERROR

======================================================================

ERROR: None

----------------------------------------------------------------------

Traceback (most recent call last):

File "/usr/local/lib/python2.7/dist-packages/marionette_client-0.7.1-py2.7.egg/marionette/marionette_test.py", line 143, in run

testMethod()

File "/home/travis/build/mozilla-b2g/gaia/tests/python/gaia-ui-tests/gaiatest/tests/functional/everythingme/test_everythingme_launch_packaged_app.py", line 26, in test_launch_packaged_app_from_search_panel

search_panel.type_into_search_box(self.app_name)

File "/home/travis/build/mozilla-b2g/gaia/tests/python/gaia-ui-tests/gaiatest/apps/homescreen/regions/search_panel.py", line 27, in type_into_search_box

self.wait_for_condition(lambda m: self.marionette.find_element(*self._search_title_query_locator).text.lower() ==

File "/home/travis/build/mozilla-b2g/gaia/tests/python/gaia-ui-tests/gaiatest/apps/base.py", line 103, in wait_for_condition

raise TimeoutException(message)

TEST-UNEXPECTED-FAIL | test_everythingme_launch_packaged_app.py test_everythingme_launch_packaged_app.TestEverythingMeSearchPanel.test_launch_packaged_app_from_search_panel | TimeoutException: Condition timed out

----------------------------------------------------------------------

Ran 1 test in 48.167s

FAILED (errors=1)
Attached file Github pull request
Attachment #8348799 - Flags: review?(amirn)
Whiteboard: [c= p=2 s= u=] → [c= p=2 s=2013.12.20 u=]
Comment on attachment 8348799 [details] [review]
Github pull request

Maybe add a comment on why this is needed. r+
Attachment #8348799 - Flags: review?(amirn) → review+
Landed: https://github.com/mozilla-b2g/gaia/commit/acd700ac3d8fe68ed2c62482cf7ca7d66ddb1775
Status: ASSIGNED → RESOLVED
Closed: 6 years ago
Resolution: --- → FIXED
Target Milestone: --- → 1.3 C1/1.4 S1(20dec)
You need to log in before you can comment on or make changes to this bug.