FireFox os build process fails in Ubuntu 13.10 because of libxul.so

RESOLVED WONTFIX

Status

Firefox OS
General
RESOLVED WONTFIX
5 years ago
4 months ago

People

(Reporter: ramanathan.sridhar, Unassigned, NeedInfo)

Tracking

Firefox Tracking Flags

(Not tracked)

Details

(Reporter)

Description

5 years ago
User Agent: Mozilla/5.0 (X11; Ubuntu; Linux x86_64; rv:26.0) Gecko/20100101 Firefox/26.0 (Beta/Release)
Build ID: 20131206145143

Steps to reproduce:

./build.sh



Actual results:

error: undefined reference to 'mozilla::dom::PannerNodeBinding::Wrap(JSContext*, JS::Handle<JSObject*>, mozilla::dom::PannerNode*, nsWrapperCache*)'
collect2: ld returned 1 exit status
make[6]: *** [libxul.so] Error 1
make[5]: *** [toolkit/library/libs] Error 2
make[4]: *** [libs] Error 2
make[3]: *** [default] Error 2
make[2]: *** [realbuild] Error 2
make[1]: *** [build] Error 2
make: *** [out/target/product/generic/obj/DATA/gecko_intermediates/gecko] Error 2

real	42m50.293s
user	47m30.125s
sys	8m6.660s



Expected results:

build should have completed

Comment 1

4 years ago
Insufficient information. Please attach the entire build log as an attachment.
Flags: needinfo?(ramanathan.sridhar)

Comment 2

4 months ago
Firefox OS is not being worked on
Status: UNCONFIRMED → RESOLVED
Last Resolved: 4 months ago
Resolution: --- → WONTFIX
You need to log in before you can comment on or make changes to this bug.