[UITests] Travis Intermittent: test_calendar_flick_through_months (test_calendar_flick_through_months.TestCalendar) ... FAIL

RESOLVED FIXED

Status

Firefox OS
Gaia::UI Tests
P1
normal
RESOLVED FIXED
4 years ago
4 years ago

People

(Reporter: kgrandon, Unassigned)

Tracking

Firefox Tracking Flags

(Not tracked)

Details

(Reporter)

Description

4 years ago
======================================================================
FAIL: None
----------------------------------------------------------------------
Traceback (most recent call last):
  File "/usr/local/lib/python2.7/dist-packages/marionette_client-0.7.2-py2.7.egg/marionette/marionette_test.py", line 143, in run
    testMethod()
  File "/home/travis/build/mozilla-b2g/gaia/tests/python/gaia-ui-tests/gaiatest/tests/functional/calendar/test_calendar_flick_through_months.py", line 30, in test_calendar_flick_through_months
    calendar.current_month_year)
TEST-UNEXPECTED-FAIL | test_calendar_flick_through_months.py test_calendar_flick_through_months.TestCalendar.test_calendar_flick_through_months | AssertionError: 'February 2014' != u'January 2014'
----------------------------------------------------------------------
Ran 1 test in 15.399s

FAILED (failures=1)
(Reporter)

Updated

4 years ago
Status: NEW → RESOLVED
Last Resolved: 4 years ago
Resolution: --- → FIXED
You need to log in before you can comment on or make changes to this bug.