Closed Bug 995990 Opened 12 years ago Closed 12 years ago

Flick to next station is not working in the FMRadio test investigate/fix

Categories

(Firefox OS Graveyard :: Gaia::UI Tests, defect, P1)

ARM
Gonk (Firefox OS)
defect

Tracking

(Not tracked)

RESOLVED DUPLICATE of bug 995989

People

(Reporter: Bebe, Unassigned)

Details

Description: Looks like the FM radio test test_radio_frequency_dialer started to fail in the master build Investigate and fix the issue Reproducible manually: NO The test is not reproducing manually I tested the flock on the dialler manually and all seems OK Environment: Gaia f3abbd2d0a60f1a1618db93f8b1957cae6de379c Gecko https://hg.mozilla.org/mozilla-central/rev/215080b813a7 BuildID 20140414040203 Version 31.0a1 ro.build.version.incremental=324 ro.build.date=Thu Dec 19 14:04:55 CST 2013 Traceback (most recent call last): 06:02:01 TEST-START test_fmradio_frequency_dialer.py 06:03:05 test_radio_frequency_dialer (test_fmradio_frequency_dialer.TestFMRadioFreqDialer) ... FAIL 06:03:06 06:03:06 ====================================================================== 06:03:06 FAIL: None 06:03:06 ---------------------------------------------------------------------- 06:03:06 Traceback (most recent call last): 06:03:06 File "/var/jenkins/workspace/b2g.hamachi.mozilla-central.ui.2/.env/local/lib/python2.7/site-packages/marionette_client-0.7.5-py2.7.egg/marionette/marionette_test.py", line 163, in run 06:03:06 testMethod() 06:03:06 File "/var/jenkins/workspace/b2g.hamachi.mozilla-central.ui.2/tests/python/gaia-ui-tests/gaiatest/tests/functional/fmradio/test_fmradio_frequency_dialer.py", line 39, in test_radio_frequency_dialer 06:03:06 self.assertNotEqual(self.fm_radio.frequency, channel) 06:03:06 TEST-UNEXPECTED-FAIL | test_fmradio_frequency_dialer.py test_fmradio_frequency_dialer.TestFMRadioFreqDialer.test_radio_frequency_dialer | AssertionError: 87.5 == 87.5 06:03:06 ---------------------------------------------------------------------- 06:03:06 Ran 1 test in 63.477s 06:03:06 06:03:06 FAILED (failures=1)
I suspect a Marionette issue
Flags: needinfo?(mdas)
Depends on: 995989
Status: NEW → RESOLVED
Closed: 12 years ago
Resolution: --- → DUPLICATE
No longer depends on: 995989
Flags: needinfo?(mdas)
You need to log in before you can comment on or make changes to this bug.