tstclnt, cmsutil seg. violation in backward compatibility tests

RESOLVED FIXED in 3.4

Status

NSS
Tools
P1
normal
RESOLVED FIXED
17 years ago
16 years ago

People

(Reporter: Sonja Mirtitsch, Assigned: Ian McGreer)

Tracking

x86
Windows NT

Firefox Tracking Flags

(Not tracked)

Details

Attachments

(4 attachments)

(Reporter)

Description

17 years ago
I have not investigated this thouroughly, but file a bug because for a while we
will not build the tip.

Windows 2000 (nssqa-win2k) passed debug and failed OPt only, sonjaNT failed both
Failures look the same on both systems, failures on 95 and NT build looked the
same or at least very similar

ssl.sh: SSL tests ===============================
ssl.sh: SSL Cipher Coverage ===============================
selfserv -p 8443 -d ../server -n nssqa-win2k.red.iplanet.com \
         -w nss -c ABCDEFabcdefghijklm -i ../tests_pid.1388  &
selfserv started at Fri Sep 14 04:25:30 PDT 2001
tstclnt -p 8443 -h nssqa-win2k -q -d . <
W:/nss/nss322/builds/20010820.1/blowfish_NT4.0_Win95/mozilla/security/nss/tests/ssl/sslreq.txt

[2] + Done(139) ?
  1100	Segmentation violation	tstclnt
RETRY: tstclnt -p 8443 -h nssqa-win2k -q -d . <
W:/nss/nss322/builds/20010820.1/blowfish_NT4.0_Win95/mozilla/security/nss/tests/ssl/sslreq.txt
[2] + Done(139) ?
  1376	Segmentation violation	tstclnt

smime.sh: S/MIME Tests ===============================
smime.sh: Signing Attached Message ------------------------------
cmsutil -S -N Alice -i alice.txt -d ../alicedir -p nss -o alice.sig
[1] + Done(139) ?
  410	Segmentation violation	cmsutil
smime.sh: Create Signature Alice . FAILED
cmsutil -D -i alice.sig -d ../bobdir -o alice.data1
[1] + Done(139) ?
  452	Segmentation violation	cmsutil
smime.sh: Decode Alice's Signature . FAILED
diff alice.txt alice.data1
1,6d0
< Date: Wed, 20 Sep 2000 00:00:01 -0700 (PDT)
< From: alice@bogus.com
< Subject: message Alice --> Bob
< To: bob@bogus.com
< < This is a test message from Alice to Bob.
smime.sh: Compare Decoded Signature and Original . FAILED
(Reporter)

Comment 1

17 years ago
Created attachment 49364 [details]
output.log
(Reporter)

Comment 2

17 years ago
Created attachment 49365 [details]
result.html

Comment 3

17 years ago
I'm presuming the subject should read: Old 'tstclnt' and 'cmsutil' seg violation
on new library. The opposite is not necessarily expected to work.

bob
(Reporter)

Comment 4

17 years ago
yes, you are right - but since that is the only combination we test in the
backward compatibility tests I did not specify this explicitly

I also noticed that the attachments I put on this bug were wrong, these are the
passed main tests and not the backward compatibility tests, I'll attach the rigt
ones now...

the Path we were using in the failed tests was

w:/nss/nss322/builds/20010820.1/blowfish_NT4.0_Win95/mozilla/dist/WINNT4.0_DBG.OBJ/bin;
w:/nss/nsstip/builds/20010914.1/blowfish_NT4.0_Win95/mozilla/dist/WINNT4.0_DBG.OBJ/lib
(Reporter)

Comment 5

17 years ago
Created attachment 49394 [details]
results.html (backward compatibility tests)
(Reporter)

Comment 6

17 years ago
Created attachment 49395 [details]
output.log (backward compatibility tests)

Comment 7

17 years ago
Assigned the bug to Ian.
Assignee: wtc → ian.mcgreer
Priority: -- → P1
Target Milestone: --- → 3.4
(Reporter)

Comment 8

17 years ago
Should I leave the backward compatibility test on now after all? I do not know
if you were still in the meeting Ian when we decided to turn of the backward
compatibility tests because Bob R. will not fix the other issues ( bug #104061 )
any time soon
(Reporter)

Updated

17 years ago
Blocks: 97209
(Reporter)

Comment 9

16 years ago
This problem has not been seen in a while
Status: NEW → RESOLVED
Last Resolved: 16 years ago
Resolution: --- → FIXED
You need to log in before you can comment on or make changes to this bug.