Closed Bug 1015848 Opened 8 years ago Closed 4 years ago

Make sure all marionette tests in v1.4 branch will be passed after bug 950673 is landed

Categories

(Firefox OS Graveyard :: Gaia, defect)

x86
macOS
defect
Not set
normal

Tracking

(Not tracked)

RESOLVED WONTFIX

People

(Reporter: evanxd, Unassigned)

Details

No description provided.
We have a travis job(https://travis-ci.org/evanxd/gaia/builds/26028701) for running marionette tests with including bug 950673 patch for 30 times. We could check the result to get the list of failing tests.
We have the below 37 intermittent failing tests with bug 950673 patch in v1.4 branch.

1) today item should back to today:

NoSuchElement: (7) Unable to locate element: #month-view li.selected

Remote Stack:

<none>

at Error.MarionetteError (/home/travis/build/evanxd/gaia/node_modules/marionette-client/lib/marionette/error.js:67:13)

at Object.Client._handleCallback (/home/travis/build/evanxd/gaia/node_modules/marionette-client/lib/marionette/client.js:474:19)

at /home/travis/build/evanxd/gaia/node_modules/marionette-client/lib/marionette/client.js:508:21

at TcpSync.send (/home/travis/build/evanxd/gaia/node_modules/marionette-client/lib/marionette/drivers/tcp-sync.js:94:10)

at Object.send (/home/travis/build/evanxd/gaia/node_modules/marionette-client/lib/marionette/client.js:455:36)

at Object.Client._sendCommand (/home/travis/build/evanxd/gaia/node_modules/marionette-client/lib/marionette/client.js:501:19)

at Object._findElement (/home/travis/build/evanxd/gaia/node_modules/marionette-client/lib/marionette/client.js:1283:19)

at Object.findElement (/home/travis/build/evanxd/gaia/node_modules/marionette-client/lib/marionette/client.js:1332:32)

at Object.MarionetteHelper.waitForElement (/home/travis/build/evanxd/gaia/node_modules/marionette-helper/index.js:128:19)

at Object.Calendar.waitForElement (/home/travis/build/evanxd/gaia/apps/calendar/test/marionette/calendar.js:131:31)

at Context.<anonymous> (/home/travis/build/evanxd/gaia/apps/calendar/test/marionette/today_test.js:45:25)

at Test.Runnable.run (/home/travis/build/evanxd/gaia/node_modules/mocha/lib/runnable.js:211:32)

at Runner.runTest (/home/travis/build/evanxd/gaia/node_modules/mocha/lib/runner.js:372:10)

at /home/travis/build/evanxd/gaia/node_modules/mocha/lib/runner.js:448:12

at next (/home/travis/build/evanxd/gaia/node_modules/mocha/lib/runner.js:297:14)

at /home/travis/build/evanxd/gaia/node_modules/mocha/lib/runner.js:307:7

at next (/home/travis/build/evanxd/gaia/node_modules/mocha/lib/runner.js:245:23)

at /home/travis/build/evanxd/gaia/node_modules/mocha/lib/runner.js:269:7

at Hook.Runnable.run (/home/travis/build/evanxd/gaia/node_modules/mocha/lib/runnable.js:213:5)

at next (/home/travis/build/evanxd/gaia/node_modules/mocha/lib/runner.js:257:10)

at /home/travis/build/evanxd/gaia/node_modules/mocha/lib/runner.js:269:7

at done (/home/travis/build/evanxd/gaia/node_modules/mocha/lib/runnable.js:185:5)

at /home/travis/build/evanxd/gaia/node_modules/mocha/lib/runnable.js:197:9

at Object.executeHook (/home/travis/build/evanxd/gaia/node_modules/marionette-client/lib/marionette/client.js:370:18)

at process._tickCallback (node.js:415:13)

2) creating an event "before each" hook:

Error: timeout exceeded!

at Object.Client.waitForSync (/home/travis/build/evanxd/gaia/node_modules/marionette-client/lib/marionette/client.js:679:16)

at Object.Client.waitFor (/home/travis/build/evanxd/gaia/node_modules/marionette-client/lib/marionette/client.js:648:60)

at Object.MarionetteHelper.waitForElement (/home/travis/build/evanxd/gaia/node_modules/marionette-helper/index.js:131:12)

at Object.Calendar.waitForElement (/home/travis/build/evanxd/gaia/apps/calendar/test/marionette/calendar.js:131:31)

at Object.Calendar.createEvent (/home/travis/build/evanxd/gaia/apps/calendar/test/marionette/calendar.js:300:10)

at Context.<anonymous> (/home/travis/build/evanxd/gaia/apps/calendar/test/marionette/create_event_test.js:33:9)

at Hook.Runnable.run (/home/travis/build/evanxd/gaia/node_modules/mocha/lib/runnable.js:211:32)

at next (/home/travis/build/evanxd/gaia/node_modules/mocha/lib/runner.js:257:10)

at /home/travis/build/evanxd/gaia/node_modules/mocha/lib/runner.js:269:7

at done (/home/travis/build/evanxd/gaia/node_modules/mocha/lib/runnable.js:185:5)

at /home/travis/build/evanxd/gaia/node_modules/mocha/lib/runnable.js:197:9

at Object.executeHook (/home/travis/build/evanxd/gaia/node_modules/marionette-client/lib/marionette/client.js:370:18)

at process._tickCallback (node.js:415:13)

3) day view "before each" hook:

Error: timeout exceeded!

at Object.Client.waitForSync (/home/travis/build/evanxd/gaia/node_modules/marionette-client/lib/marionette/client.js:679:16)

at Object.Client.waitFor (/home/travis/build/evanxd/gaia/node_modules/marionette-client/lib/marionette/client.js:648:60)

at Object.Calendar.waitForDayView (/home/travis/build/evanxd/gaia/apps/calendar/test/marionette/calendar.js:164:17)

at Context.<anonymous> (/home/travis/build/evanxd/gaia/apps/calendar/test/marionette/day_view_test.js:15:9)

at Hook.Runnable.run (/home/travis/build/evanxd/gaia/node_modules/mocha/lib/runnable.js:211:32)

at next (/home/travis/build/evanxd/gaia/node_modules/mocha/lib/runner.js:257:10)

at /home/travis/build/evanxd/gaia/node_modules/mocha/lib/runner.js:269:7

at done (/home/travis/build/evanxd/gaia/node_modules/mocha/lib/runnable.js:185:5)

at /home/travis/build/evanxd/gaia/node_modules/mocha/lib/runnable.js:197:9

at Object.executeHook (/home/travis/build/evanxd/gaia/node_modules/marionette-client/lib/marionette/client.js:370:18)

at process._tickCallback (node.js:415:13)

4) month view #months-day-view scroll:

Error: timeout exceeded!

at Object.Client.waitForSync (/home/travis/build/evanxd/gaia/node_modules/marionette-client/lib/marionette/client.js:679:16)

at Object.Client.waitFor (/home/travis/build/evanxd/gaia/node_modules/marionette-client/lib/marionette/client.js:648:60)

at Object.MarionetteHelper.waitForElement (/home/travis/build/evanxd/gaia/node_modules/marionette-helper/index.js:131:12)

at Object.Calendar.waitForElement (/home/travis/build/evanxd/gaia/apps/calendar/test/marionette/calendar.js:131:31)

at Object.Calendar.createEvent (/home/travis/build/evanxd/gaia/apps/calendar/test/marionette/calendar.js:300:10)

at Context.<anonymous> (/home/travis/build/evanxd/gaia/apps/calendar/test/marionette/month_view_test.js:16:9)

at Test.Runnable.run (/home/travis/build/evanxd/gaia/node_modules/mocha/lib/runnable.js:211:32)

at Runner.runTest (/home/travis/build/evanxd/gaia/node_modules/mocha/lib/runner.js:372:10)

at /home/travis/build/evanxd/gaia/node_modules/mocha/lib/runner.js:448:12

at next (/home/travis/build/evanxd/gaia/node_modules/mocha/lib/runner.js:297:14)

at /home/travis/build/evanxd/gaia/node_modules/mocha/lib/runner.js:307:7

at next (/home/travis/build/evanxd/gaia/node_modules/mocha/lib/runner.js:245:23)

at /home/travis/build/evanxd/gaia/node_modules/mocha/lib/runner.js:269:7

at Hook.Runnable.run (/home/travis/build/evanxd/gaia/node_modules/mocha/lib/runnable.js:213:5)

at next (/home/travis/build/evanxd/gaia/node_modules/mocha/lib/runner.js:257:10)

at /home/travis/build/evanxd/gaia/node_modules/mocha/lib/runner.js:269:7

at done (/home/travis/build/evanxd/gaia/node_modules/mocha/lib/runnable.js:185:5)

at /home/travis/build/evanxd/gaia/node_modules/mocha/lib/runnable.js:197:9

at Object.executeHook (/home/travis/build/evanxd/gaia/node_modules/marionette-client/lib/marionette/client.js:370:18)

at process._tickCallback (node.js:415:13)

5) email message list edit mode "before each" hook:

Error: timeout exceeded!

at Object.Client.waitForSync (/home/travis/build/evanxd/gaia/node_modules/marionette-client/lib/marionette/client.js:679:16)

at Object.Client.waitFor (/home/travis/build/evanxd/gaia/node_modules/marionette-client/lib/marionette/client.js:648:60)

at Object.Email._waitForTransitionEnd (/home/travis/build/evanxd/gaia/apps/email/test/marionette/lib/email.js:557:12)

at Object.Email.manualSetupImapEmail (/home/travis/build/evanxd/gaia/apps/email/test/marionette/lib/email.js:149:10)

at Context.<anonymous> (/home/travis/build/evanxd/gaia/apps/email/test/marionette/search_test.js:22:9)

at Hook.Runnable.run (/home/travis/build/evanxd/gaia/node_modules/mocha/lib/runnable.js:211:32)

at next (/home/travis/build/evanxd/gaia/node_modules/mocha/lib/runner.js:257:10)

at /home/travis/build/evanxd/gaia/node_modules/mocha/lib/runner.js:269:7

at done (/home/travis/build/evanxd/gaia/node_modules/mocha/lib/runnable.js:185:5)

at /home/travis/build/evanxd/gaia/node_modules/mocha/lib/runnable.js:197:9

at /home/travis/build/evanxd/gaia/apps/email/test/marionette/lib/servers/fakeimap.js:73:7

at /home/travis/build/evanxd/gaia/node_modules/mail-fakeservers/lib/control_server.js:59:7

at IncomingMessage.<anonymous> (/home/travis/build/evanxd/gaia/node_modules/mail-fakeservers/lib/control_request.js:30:7)

at IncomingMessage.g (events.js:180:16)

at IncomingMessage.EventEmitter.emit (events.js:117:20)

at _stream_readable.js:920:16

at process._tickCallback (node.js:415:13)

6) email message list edit mode "before each" hook:

Error: timeout exceeded!

at Object.Client.waitForSync (/home/travis/build/evanxd/gaia/node_modules/marionette-client/lib/marionette/client.js:679:16)

at Object.Client.waitFor (/home/travis/build/evanxd/gaia/node_modules/marionette-client/lib/marionette/client.js:648:60)

at Object.Email._waitForTransitionEnd (/home/travis/build/evanxd/gaia/apps/email/test/marionette/lib/email.js:557:12)

at Object.Email.manualSetupImapEmail (/home/travis/build/evanxd/gaia/apps/email/test/marionette/lib/email.js:149:10)

at Context.<anonymous> (/home/travis/build/evanxd/gaia/apps/email/test/marionette/message_list_test.js:22:9)

at Hook.Runnable.run (/home/travis/build/evanxd/gaia/node_modules/mocha/lib/runnable.js:211:32)

at next (/home/travis/build/evanxd/gaia/node_modules/mocha/lib/runner.js:257:10)

at /home/travis/build/evanxd/gaia/node_modules/mocha/lib/runner.js:269:7

at done (/home/travis/build/evanxd/gaia/node_modules/mocha/lib/runnable.js:185:5)

at /home/travis/build/evanxd/gaia/node_modules/mocha/lib/runnable.js:197:9

at /home/travis/build/evanxd/gaia/apps/email/test/marionette/lib/servers/fakeimap.js:73:7

at /home/travis/build/evanxd/gaia/node_modules/mail-fakeservers/lib/control_server.js:59:7

at IncomingMessage.<anonymous> (/home/travis/build/evanxd/gaia/node_modules/mail-fakeservers/lib/control_request.js:30:7)

at IncomingMessage.g (events.js:180:16)

at IncomingMessage.EventEmitter.emit (events.js:117:20)

at _stream_readable.js:920:16

at process._tickCallback (node.js:415:13)

7) First Time Use > FTU click thru:

Error: timeout exceeded!

at Object.Client.waitForSync (/home/travis/build/evanxd/gaia/node_modules/marionette-client/lib/marionette/client.js:679:16)

at Object.Client.waitFor (/home/travis/build/evanxd/gaia/node_modules/marionette-client/lib/marionette/client.js:648:60)

at Object.MarionetteHelper.waitForElement (/home/travis/build/evanxd/gaia/node_modules/marionette-helper/index.js:131:12)

at clickThruPanel (/home/travis/build/evanxd/gaia/apps/communications/ftu/test/marionette/ftu_test.js:17:19)

at Context.<anonymous> (/home/travis/build/evanxd/gaia/apps/communications/ftu/test/marionette/ftu_test.js:31:5)

at Test.Runnable.run (/home/travis/build/evanxd/gaia/node_modules/mocha/lib/runnable.js:211:32)

at Runner.runTest (/home/travis/build/evanxd/gaia/node_modules/mocha/lib/runner.js:372:10)

at /home/travis/build/evanxd/gaia/node_modules/mocha/lib/runner.js:448:12

at next (/home/travis/build/evanxd/gaia/node_modules/mocha/lib/runner.js:297:14)

at /home/travis/build/evanxd/gaia/node_modules/mocha/lib/runner.js:307:7

at next (/home/travis/build/evanxd/gaia/node_modules/mocha/lib/runner.js:245:23)

at /home/travis/build/evanxd/gaia/node_modules/mocha/lib/runner.js:269:7

at done (/home/travis/build/evanxd/gaia/node_modules/mocha/lib/runnable.js:185:5)

at /home/travis/build/evanxd/gaia/node_modules/mocha/lib/runnable.js:197:9

at Object.executeHook (/home/travis/build/evanxd/gaia/node_modules/marionette-client/lib/marionette/client.js:370:18)

at process._tickCallback (node.js:415:13)

8) First Time Use > FTU Wifi Scanning Tests:

Error: timeout exceeded!

at Object.Client.waitForSync (/home/travis/build/evanxd/gaia/node_modules/marionette-client/lib/marionette/client.js:679:16)

at Object.Client.waitFor (/home/travis/build/evanxd/gaia/node_modules/marionette-client/lib/marionette/client.js:648:60)

at Object.MarionetteHelper.waitForElement (/home/travis/build/evanxd/gaia/node_modules/marionette-helper/index.js:131:12)

at clickThruPanel (/home/travis/build/evanxd/gaia/apps/communications/ftu/test/marionette/ftu_test.js:17:19)

at Context.<anonymous> (/home/travis/build/evanxd/gaia/apps/communications/ftu/test/marionette/ftu_test.js:43:5)

at Test.Runnable.run (/home/travis/build/evanxd/gaia/node_modules/mocha/lib/runnable.js:211:32)

at Runner.runTest (/home/travis/build/evanxd/gaia/node_modules/mocha/lib/runner.js:372:10)

at /home/travis/build/evanxd/gaia/node_modules/mocha/lib/runner.js:448:12

at next (/home/travis/build/evanxd/gaia/node_modules/mocha/lib/runner.js:297:14)

at /home/travis/build/evanxd/gaia/node_modules/mocha/lib/runner.js:307:7

at next (/home/travis/build/evanxd/gaia/node_modules/mocha/lib/runner.js:245:23)

at /home/travis/build/evanxd/gaia/node_modules/mocha/lib/runner.js:269:7

at done (/home/travis/build/evanxd/gaia/node_modules/mocha/lib/runnable.js:185:5)

at /home/travis/build/evanxd/gaia/node_modules/mocha/lib/runnable.js:197:9

at Object.executeHook (/home/travis/build/evanxd/gaia/node_modules/marionette-client/lib/marionette/client.js:370:18)

at process._tickCallback (node.js:415:13)

9) Dialer > Keypad Clearing the number by long pressing the delete key:

Error: timeout exceeded!

at Object.Client.waitForSync (/home/travis/build/evanxd/gaia/node_modules/marionette-client/lib/marionette/client.js:679:16)

at Object.Client.waitFor (/home/travis/build/evanxd/gaia/node_modules/marionette-client/lib/marionette/client.js:648:60)

at keypadTap (/home/travis/build/evanxd/gaia/apps/communications/dialer/test/marionette/keypad_test.js:54:12)

at typeNumber (/home/travis/build/evanxd/gaia/apps/communications/dialer/test/marionette/keypad_test.js:35:5)

at Context.<anonymous> (/home/travis/build/evanxd/gaia/apps/communications/dialer/test/marionette/keypad_test.js:94:5)

at Test.Runnable.run (/home/travis/build/evanxd/gaia/node_modules/mocha/lib/runnable.js:211:32)

at Runner.runTest (/home/travis/build/evanxd/gaia/node_modules/mocha/lib/runner.js:372:10)

at /home/travis/build/evanxd/gaia/node_modules/mocha/lib/runner.js:448:12

at next (/home/travis/build/evanxd/gaia/node_modules/mocha/lib/runner.js:297:14)

at /home/travis/build/evanxd/gaia/node_modules/mocha/lib/runner.js:307:7

at next (/home/travis/build/evanxd/gaia/node_modules/mocha/lib/runner.js:245:23)

at /home/travis/build/evanxd/gaia/node_modules/mocha/lib/runner.js:269:7

at Hook.Runnable.run (/home/travis/build/evanxd/gaia/node_modules/mocha/lib/runnable.js:213:5)

at next (/home/travis/build/evanxd/gaia/node_modules/mocha/lib/runner.js:257:10)

at /home/travis/build/evanxd/gaia/node_modules/mocha/lib/runner.js:269:7

at done (/home/travis/build/evanxd/gaia/node_modules/mocha/lib/runnable.js:185:5)

at /home/travis/build/evanxd/gaia/node_modules/mocha/lib/runnable.js:197:9

at Object.executeHook (/home/travis/build/evanxd/gaia/node_modules/marionette-client/lib/marionette/client.js:370:18)

at process._tickCallback (node.js:415:13)

10) Contacts > Details Merging 15 contacts:

Error: timeout exceeded!

at Object.Client.waitForSync (/home/travis/build/evanxd/gaia/node_modules/marionette-client/lib/marionette/client.js:679:16)

at Object.Client.waitFor (/home/travis/build/evanxd/gaia/node_modules/marionette-client/lib/marionette/client.js:648:60)

at Object.MarionetteHelper.waitForElement (/home/travis/build/evanxd/gaia/node_modules/marionette-helper/index.js:131:12)

at Object.Contacts.waitForFormShown (/home/travis/build/evanxd/gaia/apps/communications/contacts/test/marionette/lib/contacts.js:132:35)

at Object.Contacts.enterContactDetails (/home/travis/build/evanxd/gaia/apps/communications/contacts/test/marionette/lib/contacts.js:161:10)

at Object.Contacts.addContact (/home/travis/build/evanxd/gaia/apps/communications/contacts/test/marionette/lib/contacts.js:182:10)

at Context.<anonymous> (/home/travis/build/evanxd/gaia/apps/communications/contacts/test/marionette/details_test.js:44:15)

at Test.Runnable.run (/home/travis/build/evanxd/gaia/node_modules/mocha/lib/runnable.js:211:32)

at Runner.runTest (/home/travis/build/evanxd/gaia/node_modules/mocha/lib/runner.js:372:10)

at /home/travis/build/evanxd/gaia/node_modules/mocha/lib/runner.js:448:12

at next (/home/travis/build/evanxd/gaia/node_modules/mocha/lib/runner.js:297:14)

at /home/travis/build/evanxd/gaia/node_modules/mocha/lib/runner.js:307:7

at next (/home/travis/build/evanxd/gaia/node_modules/mocha/lib/runner.js:245:23)

at /home/travis/build/evanxd/gaia/node_modules/mocha/lib/runner.js:269:7

at Hook.Runnable.run (/home/travis/build/evanxd/gaia/node_modules/mocha/lib/runnable.js:213:5)

at next (/home/travis/build/evanxd/gaia/node_modules/mocha/lib/runner.js:257:10)

at /home/travis/build/evanxd/gaia/node_modules/mocha/lib/runner.js:269:7

at done (/home/travis/build/evanxd/gaia/node_modules/mocha/lib/runnable.js:185:5)

at /home/travis/build/evanxd/gaia/node_modules/mocha/lib/runnable.js:197:9

at Object.executeHook (/home/travis/build/evanxd/gaia/node_modules/marionette-client/lib/marionette/client.js:370:18)

at process._tickCallback (node.js:415:13)

11) Contacts > Form Click phone number Add a simple contact:

Error: timeout exceeded!

at Object.Client.waitForSync (/home/travis/build/evanxd/gaia/node_modules/marionette-client/lib/marionette/client.js:679:16)

at Object.Client.waitFor (/home/travis/build/evanxd/gaia/node_modules/marionette-client/lib/marionette/client.js:648:60)

at Object.MarionetteHelper.waitForElement (/home/travis/build/evanxd/gaia/node_modules/marionette-helper/index.js:131:12)

at Object.Contacts.waitForFormShown (/home/travis/build/evanxd/gaia/apps/communications/contacts/test/marionette/lib/contacts.js:132:35)

at Object.Contacts.enterContactDetails (/home/travis/build/evanxd/gaia/apps/communications/contacts/test/marionette/lib/contacts.js:161:10)

at Object.Contacts.addContact (/home/travis/build/evanxd/gaia/apps/communications/contacts/test/marionette/lib/contacts.js:182:10)

at Context.<anonymous> (/home/travis/build/evanxd/gaia/apps/communications/contacts/test/marionette/form_test.js:28:15)

at Test.Runnable.run (/home/travis/build/evanxd/gaia/node_modules/mocha/lib/runnable.js:211:32)

at Runner.runTest (/home/travis/build/evanxd/gaia/node_modules/mocha/lib/runner.js:372:10)

at /home/travis/build/evanxd/gaia/node_modules/mocha/lib/runner.js:448:12

at next (/home/travis/build/evanxd/gaia/node_modules/mocha/lib/runner.js:297:14)

at /home/travis/build/evanxd/gaia/node_modules/mocha/lib/runner.js:307:7

at next (/home/travis/build/evanxd/gaia/node_modules/mocha/lib/runner.js:245:23)

at Object._onImmediate (/home/travis/build/evanxd/gaia/node_modules/mocha/lib/runner.js:274:5)

at processImmediate [as _immediateCallback] (timers.js:330:15)

12) Contacts > Form Click phone number Can create custom label:

Error: timeout exceeded!

at Object.Client.waitForSync (/home/travis/build/evanxd/gaia/node_modules/marionette-client/lib/marionette/client.js:679:16)

at Object.Client.waitFor (/home/travis/build/evanxd/gaia/node_modules/marionette-client/lib/marionette/client.js:648:60)

at Object.MarionetteHelper.waitForElement (/home/travis/build/evanxd/gaia/node_modules/marionette-helper/index.js:131:12)

at Object.Contacts.waitForFormShown (/home/travis/build/evanxd/gaia/apps/communications/contacts/test/marionette/lib/contacts.js:132:35)

at Object.Contacts.enterContactDetails (/home/travis/build/evanxd/gaia/apps/communications/contacts/test/marionette/lib/contacts.js:161:10)

at Object.Contacts.addContact (/home/travis/build/evanxd/gaia/apps/communications/contacts/test/marionette/lib/contacts.js:182:10)

at Context.<anonymous> (/home/travis/build/evanxd/gaia/apps/communications/contacts/test/marionette/form_test.js:45:15)

at Test.Runnable.run (/home/travis/build/evanxd/gaia/node_modules/mocha/lib/runnable.js:211:32)

at Runner.runTest (/home/travis/build/evanxd/gaia/node_modules/mocha/lib/runner.js:372:10)

at /home/travis/build/evanxd/gaia/node_modules/mocha/lib/runner.js:448:12

at next (/home/travis/build/evanxd/gaia/node_modules/mocha/lib/runner.js:297:14)

at /home/travis/build/evanxd/gaia/node_modules/mocha/lib/runner.js:307:7

at next (/home/travis/build/evanxd/gaia/node_modules/mocha/lib/runner.js:245:23)

at Object._onImmediate (/home/travis/build/evanxd/gaia/node_modules/mocha/lib/runner.js:274:5)

at processImmediate [as _immediateCallback] (timers.js:330:15)

13) Contacts > Form Facebook contacts Add phone number from Dialer to existing Facebook contact:

Error: timeout exceeded!

at Object.Client.waitForSync (/home/travis/build/evanxd/gaia/node_modules/marionette-client/lib/marionette/client.js:679:16)

at Object.Client.waitFor (/home/travis/build/evanxd/gaia/node_modules/marionette-client/lib/marionette/client.js:648:60)

at Context.<anonymous> (/home/travis/build/evanxd/gaia/apps/communications/contacts/test/marionette/form_test.js:140:16)

at Test.Runnable.run (/home/travis/build/evanxd/gaia/node_modules/mocha/lib/runnable.js:211:32)

at Runner.runTest (/home/travis/build/evanxd/gaia/node_modules/mocha/lib/runner.js:372:10)

at /home/travis/build/evanxd/gaia/node_modules/mocha/lib/runner.js:448:12

at next (/home/travis/build/evanxd/gaia/node_modules/mocha/lib/runner.js:297:14)

at /home/travis/build/evanxd/gaia/node_modules/mocha/lib/runner.js:307:7

at next (/home/travis/build/evanxd/gaia/node_modules/mocha/lib/runner.js:245:23)

at Object._onImmediate (/home/travis/build/evanxd/gaia/node_modules/mocha/lib/runner.js:274:5)

at processImmediate [as _immediateCallback] (timers.js:330:15)

14) Contacts > Activities webcontacts/contact activity a contact with duplicate number shows merge page:

Error: timeout exceeded!

at Object.Client.waitForSync (/home/travis/build/evanxd/gaia/node_modules/marionette-client/lib/marionette/client.js:679:16)

at Object.Client.waitFor (/home/travis/build/evanxd/gaia/node_modules/marionette-client/lib/marionette/client.js:648:60)

at Object.MarionetteHelper.waitForElement (/home/travis/build/evanxd/gaia/node_modules/marionette-helper/index.js:131:12)

at Object.Contacts.waitForFormShown (/home/travis/build/evanxd/gaia/apps/communications/contacts/test/marionette/lib/contacts.js:132:35)

at Object.Contacts.enterContactDetails (/home/travis/build/evanxd/gaia/apps/communications/contacts/test/marionette/lib/contacts.js:161:10)

at Object.Contacts.addContact (/home/travis/build/evanxd/gaia/apps/communications/contacts/test/marionette/lib/contacts.js:182:10)

at Context.<anonymous> (/home/travis/build/evanxd/gaia/apps/communications/contacts/test/marionette/activities_test.js:35:15)

at Test.Runnable.run (/home/travis/build/evanxd/gaia/node_modules/mocha/lib/runnable.js:211:32)

at Runner.runTest (/home/travis/build/evanxd/gaia/node_modules/mocha/lib/runner.js:372:10)

at /home/travis/build/evanxd/gaia/node_modules/mocha/lib/runner.js:448:12

at next (/home/travis/build/evanxd/gaia/node_modules/mocha/lib/runner.js:297:14)

at /home/travis/build/evanxd/gaia/node_modules/mocha/lib/runner.js:307:7

at next (/home/travis/build/evanxd/gaia/node_modules/mocha/lib/runner.js:245:23)

at Object._onImmediate (/home/travis/build/evanxd/gaia/node_modules/mocha/lib/runner.js:274:5)

at processImmediate [as _immediateCallback] (timers.js:330:15)

15) Clock interaction Toggling clock face:

AssertionError: analog clock is not displayed after toggle

at assert (/home/travis/build/evanxd/gaia/apps/clock/test/marionette/lib/assert.js:6:21)

at Context.<anonymous> (/home/travis/build/evanxd/gaia/apps/clock/test/marionette/clock_interaction_test.js:20:5)

at Test.Runnable.run (/home/travis/build/evanxd/gaia/node_modules/mocha/lib/runnable.js:211:32)

at Runner.runTest (/home/travis/build/evanxd/gaia/node_modules/mocha/lib/runner.js:372:10)

at /home/travis/build/evanxd/gaia/node_modules/mocha/lib/runner.js:448:12

at next (/home/travis/build/evanxd/gaia/node_modules/mocha/lib/runner.js:297:14)

at /home/travis/build/evanxd/gaia/node_modules/mocha/lib/runner.js:307:7

at next (/home/travis/build/evanxd/gaia/node_modules/mocha/lib/runner.js:245:23)

at /home/travis/build/evanxd/gaia/node_modules/mocha/lib/runner.js:269:7

at Hook.Runnable.run (/home/travis/build/evanxd/gaia/node_modules/mocha/lib/runnable.js:213:5)

at next (/home/travis/build/evanxd/gaia/node_modules/mocha/lib/runner.js:257:10)

at /home/travis/build/evanxd/gaia/node_modules/mocha/lib/runner.js:269:7

at done (/home/travis/build/evanxd/gaia/node_modules/mocha/lib/runnable.js:185:5)

at /home/travis/build/evanxd/gaia/node_modules/mocha/lib/runnable.js:197:9

at Object.executeHook (/home/travis/build/evanxd/gaia/node_modules/marionette-client/lib/marionette/client.js:370:18)

at process._tickCallback (node.js:415:13)

16) Stopwatch advancement "before each" hook:

Error: timeout exceeded!

at Object.Client.waitForSync (/home/travis/build/evanxd/gaia/node_modules/marionette-client/lib/marionette/client.js:679:16)

at Object.Client.waitFor (/home/travis/build/evanxd/gaia/node_modules/marionette-client/lib/marionette/client.js:648:60)

at Clock.waitForSlideEnd (/home/travis/build/evanxd/gaia/apps/clock/test/marionette/lib/clock.js:81:15)

at Clock.navigate (/home/travis/build/evanxd/gaia/apps/clock/test/marionette/lib/clock.js:77:8)

at Clock.Stopwatch.launch (/home/travis/build/evanxd/gaia/apps/clock/test/marionette/lib/stopwatch.js:14:8)

at Context.<anonymous> (/home/travis/build/evanxd/gaia/apps/clock/test/marionette/stopwatch_advancement_test.js:10:15)

at Hook.Runnable.run (/home/travis/build/evanxd/gaia/node_modules/mocha/lib/runnable.js:211:32)

at next (/home/travis/build/evanxd/gaia/node_modules/mocha/lib/runner.js:257:10)

at /home/travis/build/evanxd/gaia/node_modules/mocha/lib/runner.js:269:7

at done (/home/travis/build/evanxd/gaia/node_modules/mocha/lib/runnable.js:185:5)

at /home/travis/build/evanxd/gaia/node_modules/mocha/lib/runnable.js:197:9

at Object.executeHook (/home/travis/build/evanxd/gaia/node_modules/marionette-client/lib/marionette/client.js:370:18)

at process._tickCallback (node.js:415:13)

17) Alarm interaction "before each" hook:

Error: timeout exceeded!

at Object.Client.waitForSync (/home/travis/build/evanxd/gaia/node_modules/marionette-client/lib/marionette/client.js:679:16)

at Object.Client.waitFor (/home/travis/build/evanxd/gaia/node_modules/marionette-client/lib/marionette/client.js:648:60)

at Clock.waitForSlideEnd (/home/travis/build/evanxd/gaia/apps/clock/test/marionette/lib/clock.js:81:15)

at Clock.Alarm.openForm (/home/travis/build/evanxd/gaia/apps/clock/test/marionette/lib/alarm.js:131:8)

at Context.<anonymous> (/home/travis/build/evanxd/gaia/apps/clock/test/marionette/alarm_interaction_test.js:18:11)

at Hook.Runnable.run (/home/travis/build/evanxd/gaia/node_modules/mocha/lib/runnable.js:211:32)

at next (/home/travis/build/evanxd/gaia/node_modules/mocha/lib/runner.js:257:10)

at /home/travis/build/evanxd/gaia/node_modules/mocha/lib/runner.js:269:7

at done (/home/travis/build/evanxd/gaia/node_modules/mocha/lib/runnable.js:185:5)

at /home/travis/build/evanxd/gaia/node_modules/mocha/lib/runnable.js:197:9

at Object.executeHook (/home/travis/build/evanxd/gaia/node_modules/marionette-client/lib/marionette/client.js:370:18)

at process._tickCallback (node.js:415:13)

18) Lap creation "before each" hook:

Error: timeout exceeded!

at Object.Client.waitForSync (/home/travis/build/evanxd/gaia/node_modules/marionette-client/lib/marionette/client.js:679:16)

at Object.Client.waitFor (/home/travis/build/evanxd/gaia/node_modules/marionette-client/lib/marionette/client.js:648:60)

at Clock.waitForSlideEnd (/home/travis/build/evanxd/gaia/apps/clock/test/marionette/lib/clock.js:81:15)

at Clock.navigate (/home/travis/build/evanxd/gaia/apps/clock/test/marionette/lib/clock.js:77:8)

at Clock.Stopwatch.launch (/home/travis/build/evanxd/gaia/apps/clock/test/marionette/lib/stopwatch.js:14:8)

at Context.<anonymous> (/home/travis/build/evanxd/gaia/apps/clock/test/marionette/stopwatch_lap_test.js:10:15)

at Hook.Runnable.run (/home/travis/build/evanxd/gaia/node_modules/mocha/lib/runnable.js:211:32)

at next (/home/travis/build/evanxd/gaia/node_modules/mocha/lib/runner.js:257:10)

at /home/travis/build/evanxd/gaia/node_modules/mocha/lib/runner.js:269:7

at done (/home/travis/build/evanxd/gaia/node_modules/mocha/lib/runnable.js:185:5)

at /home/travis/build/evanxd/gaia/node_modules/mocha/lib/runnable.js:197:9

at Object.executeHook (/home/travis/build/evanxd/gaia/node_modules/marionette-client/lib/marionette/client.js:370:18)

at process._tickCallback (node.js:415:13)

19) using the gallery menu should let you delete images:

Error: timeout exceeded!

at Object.Client.waitForSync (/home/travis/build/evanxd/gaia/node_modules/marionette-client/lib/marionette/client.js:679:16)

at Object.Client.waitFor (/home/travis/build/evanxd/gaia/node_modules/marionette-client/lib/marionette/client.js:648:60)

at Object.MarionetteHelper.waitForElement (/home/travis/build/evanxd/gaia/node_modules/marionette-helper/index.js:131:12)

at Object.thumbnailsDeleteButton (/home/travis/build/evanxd/gaia/apps/gallery/test/marionette/lib/gallery.js:111:31)

at Context.<anonymous> (/home/travis/build/evanxd/gaia/apps/gallery/test/marionette/delete_image_test.js:44:8)

at Test.Runnable.run (/home/travis/build/evanxd/gaia/node_modules/mocha/lib/runnable.js:211:32)

at Runner.runTest (/home/travis/build/evanxd/gaia/node_modules/mocha/lib/runner.js:372:10)

at /home/travis/build/evanxd/gaia/node_modules/mocha/lib/runner.js:448:12

at next (/home/travis/build/evanxd/gaia/node_modules/mocha/lib/runner.js:297:14)

at /home/travis/build/evanxd/gaia/node_modules/mocha/lib/runner.js:307:7

at next (/home/travis/build/evanxd/gaia/node_modules/mocha/lib/runner.js:245:23)

at /home/travis/build/evanxd/gaia/node_modules/mocha/lib/runner.js:269:7

at Hook.Runnable.run (/home/travis/build/evanxd/gaia/node_modules/mocha/lib/runnable.js:213:5)

at next (/home/travis/build/evanxd/gaia/node_modules/mocha/lib/runner.js:257:10)

at /home/travis/build/evanxd/gaia/node_modules/mocha/lib/runner.js:269:7

at done (/home/travis/build/evanxd/gaia/node_modules/mocha/lib/runnable.js:185:5)

at /home/travis/build/evanxd/gaia/node_modules/mocha/lib/runnable.js:197:9

at Object.executeHook (/home/travis/build/evanxd/gaia/node_modules/marionette-client/lib/marionette/client.js:370:18)

at process._tickCallback (node.js:415:13)

20) the gallery should display an image fullscreen and go back:

Error: timeout exceeded!

at Object.Client.waitForSync (/home/travis/build/evanxd/gaia/node_modules/marionette-client/lib/marionette/client.js:679:16)

at Object.Client.waitFor (/home/travis/build/evanxd/gaia/node_modules/marionette-client/lib/marionette/client.js:648:60)

at Object.MarionetteHelper.waitForElement (/home/travis/build/evanxd/gaia/node_modules/marionette-helper/index.js:131:12)

at Object.fullscreenView (/home/travis/build/evanxd/gaia/apps/gallery/test/marionette/lib/gallery.js:73:31)

at Context.<anonymous> (/home/travis/build/evanxd/gaia/apps/gallery/test/marionette/fullscreen_image_test.js:42:18)

at Test.Runnable.run (/home/travis/build/evanxd/gaia/node_modules/mocha/lib/runnable.js:211:32)

at Runner.runTest (/home/travis/build/evanxd/gaia/node_modules/mocha/lib/runner.js:372:10)

at /home/travis/build/evanxd/gaia/node_modules/mocha/lib/runner.js:448:12

at next (/home/travis/build/evanxd/gaia/node_modules/mocha/lib/runner.js:297:14)

at /home/travis/build/evanxd/gaia/node_modules/mocha/lib/runner.js:307:7

at next (/home/travis/build/evanxd/gaia/node_modules/mocha/lib/runner.js:245:23)

at /home/travis/build/evanxd/gaia/node_modules/mocha/lib/runner.js:269:7

at Hook.Runnable.run (/home/travis/build/evanxd/gaia/node_modules/mocha/lib/runnable.js:213:5)

at next (/home/travis/build/evanxd/gaia/node_modules/mocha/lib/runner.js:257:10)

at /home/travis/build/evanxd/gaia/node_modules/mocha/lib/runner.js:269:7

at done (/home/travis/build/evanxd/gaia/node_modules/mocha/lib/runnable.js:185:5)

at /home/travis/build/evanxd/gaia/node_modules/mocha/lib/runnable.js:197:9

at Object.executeHook (/home/travis/build/evanxd/gaia/node_modules/marionette-client/lib/marionette/client.js:370:18)

at process._tickCallback (node.js:415:13)

21) the gallery should flick through images in fullscreen mode:

Error: timeout exceeded!

at Object.Client.waitForSync (/home/travis/build/evanxd/gaia/node_modules/marionette-client/lib/marionette/client.js:679:16)

at Object.Client.waitFor (/home/travis/build/evanxd/gaia/node_modules/marionette-client/lib/marionette/client.js:648:60)

at Object.MarionetteHelper.waitForElement (/home/travis/build/evanxd/gaia/node_modules/marionette-helper/index.js:131:12)

at Object.editButton (/home/travis/build/evanxd/gaia/apps/gallery/test/marionette/lib/gallery.js:126:31)

at Context.<anonymous> (/home/travis/build/evanxd/gaia/apps/gallery/test/marionette/fullscreen_image_test.js:52:8)

at Test.Runnable.run (/home/travis/build/evanxd/gaia/node_modules/mocha/lib/runnable.js:211:32)

at Runner.runTest (/home/travis/build/evanxd/gaia/node_modules/mocha/lib/runner.js:372:10)

at /home/travis/build/evanxd/gaia/node_modules/mocha/lib/runner.js:448:12

at next (/home/travis/build/evanxd/gaia/node_modules/mocha/lib/runner.js:297:14)

at /home/travis/build/evanxd/gaia/node_modules/mocha/lib/runner.js:307:7

at next (/home/travis/build/evanxd/gaia/node_modules/mocha/lib/runner.js:245:23)

at /home/travis/build/evanxd/gaia/node_modules/mocha/lib/runner.js:269:7

at Hook.Runnable.run (/home/travis/build/evanxd/gaia/node_modules/mocha/lib/runnable.js:213:5)

at next (/home/travis/build/evanxd/gaia/node_modules/mocha/lib/runner.js:257:10)

at /home/travis/build/evanxd/gaia/node_modules/mocha/lib/runner.js:269:7

at done (/home/travis/build/evanxd/gaia/node_modules/mocha/lib/runnable.js:185:5)

at /home/travis/build/evanxd/gaia/node_modules/mocha/lib/runnable.js:197:9

at Object.executeHook (/home/travis/build/evanxd/gaia/node_modules/marionette-client/lib/marionette/client.js:370:18)

at process._tickCallback (node.js:415:13)

22) manipulate sound settings "before each" hook:

Error: timeout exceeded!

at Object.Client.waitForSync (/home/travis/build/evanxd/gaia/node_modules/marionette-client/lib/marionette/client.js:679:16)

at Object.Client.waitFor (/home/travis/build/evanxd/gaia/node_modules/marionette-client/lib/marionette/client.js:648:60)

at Object.app_openPanel [as openPanel] (/home/travis/build/evanxd/gaia/apps/settings/test/marionette/app/app.js:157:17)

at Object.soundPanel (/home/travis/build/evanxd/gaia/apps/settings/test/marionette/app/app.js:108:10)

at Context.<anonymous> (/home/travis/build/evanxd/gaia/apps/settings/test/marionette/tests/sound_settings_test.js:14:29)

at Hook.Runnable.run (/home/travis/build/evanxd/gaia/node_modules/mocha/lib/runnable.js:211:32)

at next (/home/travis/build/evanxd/gaia/node_modules/mocha/lib/runner.js:257:10)

at /home/travis/build/evanxd/gaia/node_modules/mocha/lib/runner.js:269:7

at done (/home/travis/build/evanxd/gaia/node_modules/mocha/lib/runnable.js:185:5)

at /home/travis/build/evanxd/gaia/node_modules/mocha/lib/runnable.js:197:9

at Object.executeHook (/home/travis/build/evanxd/gaia/node_modules/marionette-client/lib/marionette/client.js:370:18)

at process._tickCallback (node.js:415:13)

23) manipulate hotspot wifi settings "before each" hook:

Error: timeout exceeded!

at Object.Client.waitForSync (/home/travis/build/evanxd/gaia/node_modules/marionette-client/lib/marionette/client.js:679:16)

at Object.Client.waitFor (/home/travis/build/evanxd/gaia/node_modules/marionette-client/lib/marionette/client.js:648:60)

at Object.app_openPanel [as openPanel] (/home/travis/build/evanxd/gaia/apps/settings/test/marionette/app/app.js:157:17)

at Object.hotspotPanel (/home/travis/build/evanxd/gaia/apps/settings/test/marionette/app/app.js:73:10)

at Context.<anonymous> (/home/travis/build/evanxd/gaia/apps/settings/test/marionette/tests/hotspot_wifi_settings_test.js:15:31)

at Hook.Runnable.run (/home/travis/build/evanxd/gaia/node_modules/mocha/lib/runnable.js:211:32)

at next (/home/travis/build/evanxd/gaia/node_modules/mocha/lib/runner.js:257:10)

at /home/travis/build/evanxd/gaia/node_modules/mocha/lib/runner.js:269:7

at done (/home/travis/build/evanxd/gaia/node_modules/mocha/lib/runnable.js:185:5)

at /home/travis/build/evanxd/gaia/node_modules/mocha/lib/runnable.js:197:9

at Object.executeHook (/home/travis/build/evanxd/gaia/node_modules/marionette-client/lib/marionette/client.js:370:18)

at process._tickCallback (node.js:415:13)

24) manipulate notifications settings "before each" hook:

Error: timeout exceeded!

at Object.Client.waitForSync (/home/travis/build/evanxd/gaia/node_modules/marionette-client/lib/marionette/client.js:679:16)

at Object.Client.waitFor (/home/travis/build/evanxd/gaia/node_modules/marionette-client/lib/marionette/client.js:648:60)

at Object.app_openPanel [as openPanel] (/home/travis/build/evanxd/gaia/apps/settings/test/marionette/app/app.js:157:17)

at Object.notificationsPanel (/home/travis/build/evanxd/gaia/apps/settings/test/marionette/app/app.js:101:10)

at Context.<anonymous> (/home/travis/build/evanxd/gaia/apps/settings/test/marionette/tests/notifications_settings_test.js:14:37)

at Hook.Runnable.run (/home/travis/build/evanxd/gaia/node_modules/mocha/lib/runnable.js:211:32)

at next (/home/travis/build/evanxd/gaia/node_modules/mocha/lib/runner.js:257:10)

at /home/travis/build/evanxd/gaia/node_modules/mocha/lib/runner.js:269:7

at done (/home/travis/build/evanxd/gaia/node_modules/mocha/lib/runnable.js:185:5)

at /home/travis/build/evanxd/gaia/node_modules/mocha/lib/runnable.js:197:9

at Object.executeHook (/home/travis/build/evanxd/gaia/node_modules/marionette-client/lib/marionette/client.js:370:18)

at process._tickCallback (node.js:415:13)

25) improve b2g "before each" hook:

Error: timeout exceeded!

at Object.Client.waitForSync (/home/travis/build/evanxd/gaia/node_modules/marionette-client/lib/marionette/client.js:679:16)

at Object.Client.waitFor (/home/travis/build/evanxd/gaia/node_modules/marionette-client/lib/marionette/client.js:648:60)

at Object.app_openPanel [as openPanel] (/home/travis/build/evanxd/gaia/apps/settings/test/marionette/app/app.js:157:17)

at Object.improvePanel (/home/travis/build/evanxd/gaia/apps/settings/test/marionette/app/app.js:136:20)

at Context.<anonymous> (/home/travis/build/evanxd/gaia/apps/settings/test/marionette/tests/improve_settings_test.js:13:31)

at Hook.Runnable.run (/home/travis/build/evanxd/gaia/node_modules/mocha/lib/runnable.js:211:32)

at next (/home/travis/build/evanxd/gaia/node_modules/mocha/lib/runner.js:257:10)

at /home/travis/build/evanxd/gaia/node_modules/mocha/lib/runner.js:269:7

at done (/home/travis/build/evanxd/gaia/node_modules/mocha/lib/runnable.js:185:5)

at /home/travis/build/evanxd/gaia/node_modules/mocha/lib/runnable.js:197:9

at Object.executeHook (/home/travis/build/evanxd/gaia/node_modules/marionette-client/lib/marionette/client.js:370:18)

at process._tickCallback (node.js:415:13)

26) manipulate battery settings "before each" hook:

Error: timeout exceeded!

at Object.Client.waitForSync (/home/travis/build/evanxd/gaia/node_modules/marionette-client/lib/marionette/client.js:679:16)

at Object.Client.waitFor (/home/travis/build/evanxd/gaia/node_modules/marionette-client/lib/marionette/client.js:648:60)

at Object.app_openPanel [as openPanel] (/home/travis/build/evanxd/gaia/apps/settings/test/marionette/app/app.js:157:17)

at Object.batteryPanel (/home/travis/build/evanxd/gaia/apps/settings/test/marionette/app/app.js:94:10)

at Context.<anonymous> (/home/travis/build/evanxd/gaia/apps/settings/test/marionette/tests/battery_settings_test.js:14:31)

at Hook.Runnable.run (/home/travis/build/evanxd/gaia/node_modules/mocha/lib/runnable.js:211:32)

at next (/home/travis/build/evanxd/gaia/node_modules/mocha/lib/runner.js:257:10)

at /home/travis/build/evanxd/gaia/node_modules/mocha/lib/runner.js:269:7

at done (/home/travis/build/evanxd/gaia/node_modules/mocha/lib/runnable.js:185:5)

at /home/travis/build/evanxd/gaia/node_modules/mocha/lib/runnable.js:197:9

at Object.executeHook (/home/travis/build/evanxd/gaia/node_modules/marionette-client/lib/marionette/client.js:370:18)

at process._tickCallback (node.js:415:13)

27) manipulate language settings "before each" hook:

Error: timeout exceeded!

at Object.Client.waitForSync (/home/travis/build/evanxd/gaia/node_modules/marionette-client/lib/marionette/client.js:679:16)

at Object.Client.waitFor (/home/travis/build/evanxd/gaia/node_modules/marionette-client/lib/marionette/client.js:648:60)

at Object.app_openPanel [as openPanel] (/home/travis/build/evanxd/gaia/apps/settings/test/marionette/app/app.js:157:17)

at Object.languagePanel (/home/travis/build/evanxd/gaia/apps/settings/test/marionette/app/app.js:115:10)

at Context.<anonymous> (/home/travis/build/evanxd/gaia/apps/settings/test/marionette/tests/language_settings_test.js:15:32)

at Hook.Runnable.run (/home/travis/build/evanxd/gaia/node_modules/mocha/lib/runnable.js:211:32)

at next (/home/travis/build/evanxd/gaia/node_modules/mocha/lib/runner.js:257:10)

at /home/travis/build/evanxd/gaia/node_modules/mocha/lib/runner.js:269:7

at done (/home/travis/build/evanxd/gaia/node_modules/mocha/lib/runnable.js:185:5)

at /home/travis/build/evanxd/gaia/node_modules/mocha/lib/runnable.js:197:9

at Object.executeHook (/home/travis/build/evanxd/gaia/node_modules/marionette-client/lib/marionette/client.js:370:18)

at process._tickCallback (node.js:415:13)

28) manipulate bluetooth settings "before each" hook:

Error: timeout exceeded!

at Object.Client.waitForSync (/home/travis/build/evanxd/gaia/node_modules/marionette-client/lib/marionette/client.js:679:16)

at Object.Client.waitFor (/home/travis/build/evanxd/gaia/node_modules/marionette-client/lib/marionette/client.js:648:60)

at Object.app_openPanel [as openPanel] (/home/travis/build/evanxd/gaia/apps/settings/test/marionette/app/app.js:157:17)

at Object.bluetoothPanel (/home/travis/build/evanxd/gaia/apps/settings/test/marionette/app/app.js:59:10)

at Context.<anonymous> (/home/travis/build/evanxd/gaia/apps/settings/test/marionette/tests/bluetooth_settings_test.js:14:33)

at Hook.Runnable.run (/home/travis/build/evanxd/gaia/node_modules/mocha/lib/runnable.js:211:32)

at next (/home/travis/build/evanxd/gaia/node_modules/mocha/lib/runner.js:257:10)

at /home/travis/build/evanxd/gaia/node_modules/mocha/lib/runner.js:269:7

at done (/home/travis/build/evanxd/gaia/node_modules/mocha/lib/runnable.js:185:5)

at /home/travis/build/evanxd/gaia/node_modules/mocha/lib/runnable.js:197:9

at Object.executeHook (/home/travis/build/evanxd/gaia/node_modules/marionette-client/lib/marionette/client.js:370:18)

at process._tickCallback (node.js:415:13)

29) manipulate screenLock settings "before each" hook:

Error: timeout exceeded!

at Object.Client.waitForSync (/home/travis/build/evanxd/gaia/node_modules/marionette-client/lib/marionette/client.js:679:16)

at Object.Client.waitFor (/home/travis/build/evanxd/gaia/node_modules/marionette-client/lib/marionette/client.js:648:60)

at Object.app_openPanel [as openPanel] (/home/travis/build/evanxd/gaia/apps/settings/test/marionette/app/app.js:157:17)

at Object.screenLockPanel (/home/travis/build/evanxd/gaia/apps/settings/test/marionette/app/app.js:122:10)

at Context.<anonymous> (/home/travis/build/evanxd/gaia/apps/settings/test/marionette/tests/screen_lock_settings_test.js:15:34)

at Hook.Runnable.run (/home/travis/build/evanxd/gaia/node_modules/mocha/lib/runnable.js:211:32)

at next (/home/travis/build/evanxd/gaia/node_modules/mocha/lib/runner.js:257:10)

at /home/travis/build/evanxd/gaia/node_modules/mocha/lib/runner.js:269:7

at done (/home/travis/build/evanxd/gaia/node_modules/mocha/lib/runnable.js:185:5)

at /home/travis/build/evanxd/gaia/node_modules/mocha/lib/runnable.js:197:9

at Object.executeHook (/home/travis/build/evanxd/gaia/node_modules/marionette-client/lib/marionette/client.js:370:18)

at process._tickCallback (node.js:415:13)

30) manipulate support settings check support without SIM custom "before each" hook:

Error: timeout exceeded!

at Object.Client.waitForSync (/home/travis/build/evanxd/gaia/node_modules/marionette-client/lib/marionette/client.js:679:16)

at Object.Client.waitFor (/home/travis/build/evanxd/gaia/node_modules/marionette-client/lib/marionette/client.js:648:60)

at Object.app_openPanel [as openPanel] (/home/travis/build/evanxd/gaia/apps/settings/test/marionette/app/app.js:157:17)

at Object.supportPanel (/home/travis/build/evanxd/gaia/apps/settings/test/marionette/app/app.js:87:10)

at gotoSupportPanel (/home/travis/build/evanxd/gaia/apps/settings/test/marionette/tests/support_settings_test.js:14:31)

at Context.<anonymous> (/home/travis/build/evanxd/gaia/apps/settings/test/marionette/tests/support_settings_test.js:20:7)

at Hook.Runnable.run (/home/travis/build/evanxd/gaia/node_modules/mocha/lib/runnable.js:211:32)

at next (/home/travis/build/evanxd/gaia/node_modules/mocha/lib/runner.js:257:10)

at Object._onImmediate (/home/travis/build/evanxd/gaia/node_modules/mocha/lib/runner.js:274:5)

at processImmediate [as _immediateCallback] (timers.js:330:15)

31) manipulate display settings "before each" hook:

Error: timeout exceeded!

at Object.Client.waitForSync (/home/travis/build/evanxd/gaia/node_modules/marionette-client/lib/marionette/client.js:679:16)

at Object.Client.waitFor (/home/travis/build/evanxd/gaia/node_modules/marionette-client/lib/marionette/client.js:648:60)

at Object.app_openPanel [as openPanel] (/home/travis/build/evanxd/gaia/apps/settings/test/marionette/app/app.js:157:17)

at Object.displayPanel (/home/travis/build/evanxd/gaia/apps/settings/test/marionette/app/app.js:129:20)

at Context.<anonymous> (/home/travis/build/evanxd/gaia/apps/settings/test/marionette/tests/display_settings_test.js:17:31)

at Hook.Runnable.run (/home/travis/build/evanxd/gaia/node_modules/mocha/lib/runnable.js:211:32)

at next (/home/travis/build/evanxd/gaia/node_modules/mocha/lib/runner.js:257:10)

at /home/travis/build/evanxd/gaia/node_modules/mocha/lib/runner.js:269:7

at done (/home/travis/build/evanxd/gaia/node_modules/mocha/lib/runnable.js:185:5)

at /home/travis/build/evanxd/gaia/node_modules/mocha/lib/runnable.js:197:9

at Object.executeHook (/home/travis/build/evanxd/gaia/node_modules/marionette-client/lib/marionette/client.js:370:18)

at process._tickCallback (node.js:415:13)

32) Settings Open settings Settings is open:

Error: timeout exceeded!

at Object.Client.waitForSync (/home/travis/build/evanxd/gaia/node_modules/marionette-client/lib/marionette/client.js:679:16)

at Object.Client.waitFor (/home/travis/build/evanxd/gaia/node_modules/marionette-client/lib/marionette/client.js:648:60)

at Object.MarionetteHelper.waitForElement (/home/travis/build/evanxd/gaia/node_modules/marionette-helper/index.js:131:12)

at Context.<anonymous> (/home/travis/build/evanxd/gaia/apps/browser/test/marionette/settings_test.js:26:21)

at Test.Runnable.run (/home/travis/build/evanxd/gaia/node_modules/mocha/lib/runnable.js:211:32)

at Runner.runTest (/home/travis/build/evanxd/gaia/node_modules/mocha/lib/runner.js:372:10)

at /home/travis/build/evanxd/gaia/node_modules/mocha/lib/runner.js:448:12

at next (/home/travis/build/evanxd/gaia/node_modules/mocha/lib/runner.js:297:14)

at /home/travis/build/evanxd/gaia/node_modules/mocha/lib/runner.js:307:7

at next (/home/travis/build/evanxd/gaia/node_modules/mocha/lib/runner.js:245:23)

at /home/travis/build/evanxd/gaia/node_modules/mocha/lib/runner.js:269:7

at Hook.Runnable.run (/home/travis/build/evanxd/gaia/node_modules/mocha/lib/runnable.js:213:5)

at next (/home/travis/build/evanxd/gaia/node_modules/mocha/lib/runner.js:257:10)

at Object._onImmediate (/home/travis/build/evanxd/gaia/node_modules/mocha/lib/runner.js:274:5)

at processImmediate [as _immediateCallback] (timers.js:330:15)

33) Settings Open settings No search engine choices:

Error: timeout exceeded!

at Object.Client.waitForSync (/home/travis/build/evanxd/gaia/node_modules/marionette-client/lib/marionette/client.js:679:16)

at Object.Client.waitFor (/home/travis/build/evanxd/gaia/node_modules/marionette-client/lib/marionette/client.js:648:60)

at Object.MarionetteHelper.waitForElement (/home/travis/build/evanxd/gaia/node_modules/marionette-helper/index.js:131:12)

at Context.<anonymous> (/home/travis/build/evanxd/gaia/apps/browser/test/marionette/settings_test.js:31:21)

at Test.Runnable.run (/home/travis/build/evanxd/gaia/node_modules/mocha/lib/runnable.js:211:32)

at Runner.runTest (/home/travis/build/evanxd/gaia/node_modules/mocha/lib/runner.js:372:10)

at /home/travis/build/evanxd/gaia/node_modules/mocha/lib/runner.js:448:12

at next (/home/travis/build/evanxd/gaia/node_modules/mocha/lib/runner.js:297:14)

at /home/travis/build/evanxd/gaia/node_modules/mocha/lib/runner.js:307:7

at next (/home/travis/build/evanxd/gaia/node_modules/mocha/lib/runner.js:245:23)

at /home/travis/build/evanxd/gaia/node_modules/mocha/lib/runner.js:269:7

at Hook.Runnable.run (/home/travis/build/evanxd/gaia/node_modules/mocha/lib/runnable.js:213:5)

at next (/home/travis/build/evanxd/gaia/node_modules/mocha/lib/runner.js:257:10)

at Object._onImmediate (/home/travis/build/evanxd/gaia/node_modules/mocha/lib/runner.js:274:5)

at processImmediate [as _immediateCallback] (timers.js:330:15)

34) search navigate to coolpage.html loads coolpage.html:

AssertionError: correct iframe

at Context.<anonymous> (/home/travis/build/evanxd/gaia/apps/browser/test/marionette/navigate_test.js:43:14)

at Test.Runnable.run (/home/travis/build/evanxd/gaia/node_modules/mocha/lib/runnable.js:211:32)

at Runner.runTest (/home/travis/build/evanxd/gaia/node_modules/mocha/lib/runner.js:372:10)

at /home/travis/build/evanxd/gaia/node_modules/mocha/lib/runner.js:448:12

at next (/home/travis/build/evanxd/gaia/node_modules/mocha/lib/runner.js:297:14)

at /home/travis/build/evanxd/gaia/node_modules/mocha/lib/runner.js:307:7

at next (/home/travis/build/evanxd/gaia/node_modules/mocha/lib/runner.js:245:23)

at /home/travis/build/evanxd/gaia/node_modules/mocha/lib/runner.js:269:7

at Hook.Runnable.run (/home/travis/build/evanxd/gaia/node_modules/mocha/lib/runnable.js:213:5)

at next (/home/travis/build/evanxd/gaia/node_modules/mocha/lib/runner.js:257:10)

at Object._onImmediate (/home/travis/build/evanxd/gaia/node_modules/mocha/lib/runner.js:274:5)

at processImmediate [as _immediateCallback] (timers.js:330:15)

35) search navigate to coolpage.html context menu opens after a context menu:

NoSuchElement: (7) Unable to locate element: #link

Remote Stack:

<none>

at Error.MarionetteError (/home/travis/build/evanxd/gaia/node_modules/marionette-client/lib/marionette/error.js:67:13)

at Object.Client._handleCallback (/home/travis/build/evanxd/gaia/node_modules/marionette-client/lib/marionette/client.js:474:19)

at /home/travis/build/evanxd/gaia/node_modules/marionette-client/lib/marionette/client.js:508:21

at TcpSync.send (/home/travis/build/evanxd/gaia/node_modules/marionette-client/lib/marionette/drivers/tcp-sync.js:94:10)

at Object.send (/home/travis/build/evanxd/gaia/node_modules/marionette-client/lib/marionette/client.js:455:36)

at Object.Client._sendCommand (/home/travis/build/evanxd/gaia/node_modules/marionette-client/lib/marionette/client.js:501:19)

at Object._findElement (/home/travis/build/evanxd/gaia/node_modules/marionette-client/lib/marionette/client.js:1283:19)

at Object.findElement (/home/travis/build/evanxd/gaia/node_modules/marionette-client/lib/marionette/client.js:1332:32)

at Object.MarionetteHelper.waitForElement (/home/travis/build/evanxd/gaia/node_modules/marionette-helper/index.js:128:19)

at longTap (/home/travis/build/evanxd/gaia/apps/browser/test/marionette/contextmenu_test.js:43:21)

at openTab (/home/travis/build/evanxd/gaia/apps/browser/test/marionette/contextmenu_test.js:57:7)

at Context.<anonymous> (/home/travis/build/evanxd/gaia/apps/browser/test/marionette/contextmenu_test.js:81:7)

at Test.Runnable.run (/home/travis/build/evanxd/gaia/node_modules/mocha/lib/runnable.js:211:32)

at Runner.runTest (/home/travis/build/evanxd/gaia/node_modules/mocha/lib/runner.js:372:10)

at /home/travis/build/evanxd/gaia/node_modules/mocha/lib/runner.js:448:12

at next (/home/travis/build/evanxd/gaia/node_modules/mocha/lib/runner.js:297:14)

at /home/travis/build/evanxd/gaia/node_modules/mocha/lib/runner.js:307:7

at next (/home/travis/build/evanxd/gaia/node_modules/mocha/lib/runner.js:245:23)

at /home/travis/build/evanxd/gaia/node_modules/mocha/lib/runner.js:269:7

at Hook.Runnable.run (/home/travis/build/evanxd/gaia/node_modules/mocha/lib/runnable.js:213:5)

at next (/home/travis/build/evanxd/gaia/node_modules/mocha/lib/runner.js:257:10)

at Object._onImmediate (/home/travis/build/evanxd/gaia/node_modules/mocha/lib/runner.js:274:5)

at processImmediate [as _immediateCallback] (timers.js:330:15)

36) search navigate to coolpage.html context menu opens after a cancel:

NoSuchElement: (7) Unable to locate element: #link

Remote Stack:

<none>

at Error.MarionetteError (/home/travis/build/evanxd/gaia/node_modules/marionette-client/lib/marionette/error.js:67:13)

at Object.Client._handleCallback (/home/travis/build/evanxd/gaia/node_modules/marionette-client/lib/marionette/client.js:474:19)

at /home/travis/build/evanxd/gaia/node_modules/marionette-client/lib/marionette/client.js:508:21

at TcpSync.send (/home/travis/build/evanxd/gaia/node_modules/marionette-client/lib/marionette/drivers/tcp-sync.js:94:10)

at Object.send (/home/travis/build/evanxd/gaia/node_modules/marionette-client/lib/marionette/client.js:455:36)

at Object.Client._sendCommand (/home/travis/build/evanxd/gaia/node_modules/marionette-client/lib/marionette/client.js:501:19)

at Object._findElement (/home/travis/build/evanxd/gaia/node_modules/marionette-client/lib/marionette/client.js:1283:19)

at Object.findElement (/home/travis/build/evanxd/gaia/node_modules/marionette-client/lib/marionette/client.js:1332:32)

at Object.MarionetteHelper.waitForElement (/home/travis/build/evanxd/gaia/node_modules/marionette-helper/index.js:128:19)

at longTap (/home/travis/build/evanxd/gaia/apps/browser/test/marionette/contextmenu_test.js:43:21)

at openTab (/home/travis/build/evanxd/gaia/apps/browser/test/marionette/contextmenu_test.js:57:7)

at Context.<anonymous> (/home/travis/build/evanxd/gaia/apps/browser/test/marionette/contextmenu_test.js:87:7)

at Test.Runnable.run (/home/travis/build/evanxd/gaia/node_modules/mocha/lib/runnable.js:211:32)

at Runner.runTest (/home/travis/build/evanxd/gaia/node_modules/mocha/lib/runner.js:372:10)

at /home/travis/build/evanxd/gaia/node_modules/mocha/lib/runner.js:448:12

at next (/home/travis/build/evanxd/gaia/node_modules/mocha/lib/runner.js:297:14)

at /home/travis/build/evanxd/gaia/node_modules/mocha/lib/runner.js:307:7

at next (/home/travis/build/evanxd/gaia/node_modules/mocha/lib/runner.js:245:23)

at /home/travis/build/evanxd/gaia/node_modules/mocha/lib/runner.js:269:7

at Hook.Runnable.run (/home/travis/build/evanxd/gaia/node_modules/mocha/lib/runnable.js:213:5)

at next (/home/travis/build/evanxd/gaia/node_modules/mocha/lib/runner.js:257:10)

at Object._onImmediate (/home/travis/build/evanxd/gaia/node_modules/mocha/lib/runner.js:274:5)

at processImmediate [as _immediateCallback] (timers.js:330:15)

37) Awesomescreen Open awesomescreen Awesomescreen is open:

Error: timeout exceeded!

at Object.Client.waitForSync (/home/travis/build/evanxd/gaia/node_modules/marionette-client/lib/marionette/client.js:679:16)

at Object.Client.waitFor (/home/travis/build/evanxd/gaia/node_modules/marionette-client/lib/marionette/client.js:648:60)

at Object.MarionetteHelper.waitForElement (/home/travis/build/evanxd/gaia/node_modules/marionette-helper/index.js:131:12)

at Context.<anonymous> (/home/travis/build/evanxd/gaia/apps/browser/test/marionette/awesomescreen_test.js:23:21)

at Test.Runnable.run (/home/travis/build/evanxd/gaia/node_modules/mocha/lib/runnable.js:211:32)

at Runner.runTest (/home/travis/build/evanxd/gaia/node_modules/mocha/lib/runner.js:372:10)

at /home/travis/build/evanxd/gaia/node_modules/mocha/lib/runner.js:448:12

at next (/home/travis/build/evanxd/gaia/node_modules/mocha/lib/runner.js:297:14)

at /home/travis/build/evanxd/gaia/node_modules/mocha/lib/runner.js:307:7

at next (/home/travis/build/evanxd/gaia/node_modules/mocha/lib/runner.js:245:23)

at /home/travis/build/evanxd/gaia/node_modules/mocha/lib/runner.js:269:7

at Hook.Runnable.run (/home/travis/build/evanxd/gaia/node_modules/mocha/lib/runnable.js:213:5)

at next (/home/travis/build/evanxd/gaia/node_modules/mocha/lib/runner.js:257:10)

at Object._onImmediate (/home/travis/build/evanxd/gaia/node_modules/mocha/lib/runner.js:274:5)

at processImmediate [as _immediateCallback] (timers.js:330:15)

make: *** [test-integration-test] Error 37
The statistics of failing test case for each app(extracted from Comment 3)

Browser: 4
Calendar: 4
Clock: 4
Contacts: 5
Dialer: 1
Email: 2
FTU: 2
Gallery: 3
Settings: 12
Firefox OS is not being worked on
Status: NEW → RESOLVED
Closed: 4 years ago
Resolution: --- → WONTFIX
You need to log in before you can comment on or make changes to this bug.