Closed Bug 1104997 Opened 5 years ago Closed 5 years ago

Fix Thunderbird bustage from Bug 1091668

Categories

(Release Engineering :: General, defect, blocker)

x86
Windows 8
defect
Not set
blocker

Tracking

(Not tracked)

RESOLVED FIXED

People

(Reporter: clokep, Assigned: clokep)

References

Details

(Keywords: dogfood, regression)

Attachments

(1 file)

Bug 1091668 busted Thunderbird on Windows since it uses topsrcdir instead of MOZILLA_DIR.

I threw up a try build with this: https://treeherder.mozilla.org/#/jobs?repo=try-comm-central&revision=33666fe1835d
Attachment #8528593 - Flags: review?(ted)
I should have included the bustage log in here too, but was rushed. Sorry about that:

WARNING: Found 367 duplicated files taking 629006 bytes (uncompressed)
c:/builds/moz2_slave/tb-c-cen-w32-d-000000000000000/build/objdir-tb/_virtualenv/Scripts/python.exe c:/builds/moz2_slave/tb-c-cen-w32-d-000000000000000/build/python/eme/gen-eme-voucher.py -input ../../dist/bin/plugin-container.exe -output ../../dist/thunderbird/voucher.bin && python c:/builds/moz2_slave/tb-c-cen-w32-d-000000000000000/tools/release/signing/signtool.py --cachedir c:/builds/moz2_slave/tb-c-cen-w32-d-000000000000000/signing_cache -t c:/builds/moz2_slave/tb-c-cen-w32-d-000000000000000/token -n c:/builds/moz2_slave/tb-c-cen-w32-d-000000000000000/nonce -c c:/builds/moz2_slave/tb-c-cen-w32-d-000000000000000/tools/release/signing/host.cert -H gpg:osslsigncode:signcode:mar:jar:b2gmar:emevoucher:signing4.srv.releng.scl3.mozilla.com:9110 -H gpg:osslsigncode:signcode:mar:jar:b2gmar:emevoucher:signing5.srv.releng.scl3.mozilla.com:9110 -H gpg:osslsigncode:signcode:mar:jar:b2gmar:emevoucher:signing6.srv.releng.scl3.mozilla.com:9110 -H dmg:mac-signing2.srv.releng.scl3.mozilla.com:9110 -H dmg:mac-signing3.srv.releng.scl3.mozilla.com:9110 -H dmgv2:mac-v2-signing1.srv.releng.scl3.mozilla.com:9110 -H dmgv2:mac-v2-signing2.srv.releng.scl3.mozilla.com:9110 -H dmgv2:mac-v2-signing3.srv.releng.scl3.mozilla.com:9110 -H dmgv2:mac-v2-signing4.srv.releng.scl3.mozilla.com:9110 -f emevoucher "../../dist/thunderbird/voucher.bin"
c:/builds/moz2_slave/tb-c-cen-w32-d-000000000000000/build/mozilla/toolkit/mozapps/installer/packager.mk:696: recipe for target 'stage-package' failed
mozmake.exe[3]: Leaving directory 'c:/builds/moz2_slave/tb-c-cen-w32-d-000000000000000/build/objdir-tb/mail/installer'
c:/builds/moz2_slave/tb-c-cen-w32-d-000000000000000/build/mozilla/toolkit/mozapps/installer/packager.mk:742: recipe for target 'make-package' failed
mozmake.exe[2]: Leaving directory 'c:/builds/moz2_slave/tb-c-cen-w32-d-000000000000000/build/objdir-tb/mail/installer'
c:/builds/moz2_slave/tb-c-cen-w32-d-000000000000000/build/config/rules.mk:490: recipe for target 'default' failed
mozmake.exe[1]: Leaving directory 'c:/builds/moz2_slave/tb-c-cen-w32-d-000000000000000/build/objdir-tb/mail/installer'
c:/builds/moz2_slave/tb-c-cen-w32-d-000000000000000/build/mozilla/../mail/build.mk:10: recipe for target 'package' failed
c:\builds\moz2_slave\tb-c-cen-w32-d-000000000000000\build\objdir-tb\_virtualenv\Scripts\python.exe: can't open file 'c:/builds/moz2_slave/tb-c-cen-w32-d-000000000000000/build/python/eme/gen-eme-voucher.py': [Errno 2] No such file or directory
mozmake.exe[3]: *** [stage-package] Error 2
mozmake.exe[2]: *** [make-package] Error 2
mozmake.exe[1]: *** [default] Error 2
pymake\..\..\mozmake.exe: *** [package] Error 2
Severity: normal → blocker
Keywords: dogfood, regression
Attachment #8528593 - Flags: review?(ted) → review+
Thanks for being so responsive Michael!

https://hg.mozilla.org/integration/mozilla-inbound/rev/9faa3a9168f3
https://hg.mozilla.org/mozilla-central/rev/9faa3a9168f3
Status: ASSIGNED → RESOLVED
Closed: 5 years ago
Resolution: --- → FIXED
Component: General Automation → General
You need to log in before you can comment on or make changes to this bug.