Closed Bug 1156777 Opened 5 years ago Closed 5 years ago

nsParseMailbox.cpp:505:55: error: 'do_QueryObject' was not declared in this scope

Categories

(MailNews Core :: Backend, defect)

defect
Not set

Tracking

(firefox40 affected, thunderbird40 fixed, seamonkey2.37 fixed)

RESOLVED FIXED
Thunderbird 40.0
Tracking Status
firefox40 --- affected
thunderbird40 --- fixed
seamonkey2.37 --- fixed

People

(Reporter: philip.chee, Assigned: philip.chee)

References

Details

Attachments

(1 file)

https://treeherder.mozilla.org/logviewer.html#?job_id=16675&repo=comm-central

/builds/slave/tb-c-cen-lx-ntly-0000000000000/build/mailnews/local/src/nsParseMailbox.cpp: In member function 'nsresult nsMsgMailboxParser::AcquireFolderLock()':
/builds/slave/tb-c-cen-lx-ntly-0000000000000/build/mailnews/local/src/nsParseMailbox.cpp:505:55: error: 'do_QueryObject' was not declared in this scope
make[5]: *** [nsParseMailbox.o] Error 1
make[4]: *** [mailnews/local/src/target] Error 2
Fixes comm-central bustage
Assignee: nobody → philip.chee
Status: NEW → ASSIGNED
Attachment #8595368 - Flags: review?(rkent)
Attachment #8595368 - Attachment description: include nsQueryObject.h → include nsQueryObject.h rs=jcranmer bustage fix
Attachment #8595368 - Flags: review?(rkent) → review+
https://hg.mozilla.org/comm-central/rev/2436c290a3e3
Status: ASSIGNED → RESOLVED
Closed: 5 years ago
Resolution: --- → FIXED
Target Milestone: --- → Thunderbird 40.0
You need to log in before you can comment on or make changes to this bug.