Move phone-builder docker image to hub

RESOLVED FIXED in mozilla44

Status

P1
normal
RESOLVED FIXED
4 years ago
3 years ago

People

(Reporter: wcosta, Assigned: wcosta)

Tracking

unspecified
mozilla44

Details

Attachments

(1 attachment, 1 obsolete attachment)

Comment hidden (empty)
(Assignee)

Comment 1

4 years ago
Created attachment 8607450 [details]
MozReview Request: bz://1166217/wcosta

/r/9021 - Bug 1166217: Move phone-builder image to docker hub.

Pull down this commit:

hg pull -r d8a505066b3b8f486b2cb597706bd2a315962fed https://reviewboard-hg.mozilla.org/gecko/
Attachment #8607450 - Flags: review?(jlal)
(Assignee)

Updated

4 years ago
Attachment #8607450 - Flags: review?(jlal) → review?(garndt)
(Assignee)

Comment 2

4 years ago
Comment on attachment 8607450 [details]
MozReview Request: bz://1166217/wcosta

/r/9021 - Bug 1166217: Move phone-builder image to docker hub.

Pull down this commit:

hg pull -r d8a505066b3b8f486b2cb597706bd2a315962fed https://reviewboard-hg.mozilla.org/gecko/

Updated

4 years ago
Attachment #8607450 - Flags: review?(garndt) → review+

Comment 3

4 years ago
Comment on attachment 8607450 [details]
MozReview Request: bz://1166217/wcosta

https://reviewboard.mozilla.org/r/9019/#review7643

Ship It!

Comment 4

4 years ago
Do not push this yet though because we need to have the new docker hub credentials on the workers (working on that now)
(Assignee)

Updated

4 years ago
No longer blocks: 1148630

Comment 5

4 years ago
The workers have been updated so you should be able to push this.
(Assignee)

Comment 6

3 years ago
Comment on attachment 8607450 [details]
MozReview Request: bz://1166217/wcosta
Attachment #8607450 - Attachment is obsolete: true
Attachment #8620330 - Flags: review+
(Assignee)

Comment 7

3 years ago
Created attachment 8620330 [details]
MozReview Request: Bug 1166217: Move phone-builder image to docker hub.
Component: TaskCluster → General
Product: Testing → Taskcluster

Comment 8

3 years ago
Wander, will this be moved over at some point?
Flags: needinfo?(wcosta)
(Assignee)

Comment 9

3 years ago
iirc, there was some kind of issue with hub (which I don't exactly remember) that prevented the migration.
Flags: needinfo?(wcosta)
(Assignee)

Comment 12

3 years ago
(In reply to Wes Kocher (:KWierso) from comment #11)
> This seems to have broken device builds:
> 
> https://treeherder.mozilla.org/logviewer.html#?job_id=2802105&repo=b2g-
> inbound
> 
> Backed out in https://hg.mozilla.org/integration/b2g-inbound/rev/ec562090398b

It turns out this was a issue with perm configs, garndt fixed it and it now works:
https://tools.taskcluster.net/task-inspector/#d2u3v8R2SzS-QGrkk1xWfA/1

How is the path to get the patch applied again?
Flags: needinfo?(wcosta) → needinfo?(wkocher)
(In reply to Wander Lairson Costa [:wcosta] from comment #12)
> How is the path to get the patch applied again?

| hg graft -fr 231127a46d6e | on an up to date tree should pull https://hg.mozilla.org/integration/b2g-inbound/rev/231127a46d6e back in for you to re-push it.
Flags: needinfo?(wkocher)
https://hg.mozilla.org/mozilla-central/rev/86fb1100a8cf
Status: ASSIGNED → RESOLVED
Last Resolved: 3 years ago
Resolution: --- → FIXED
Target Milestone: --- → mozilla43
sorry had to back this out for bustages like https://treeherder.mozilla.org/logviewer.html#?job_id=2247780&repo=mozilla-central
Status: RESOLVED → REOPENED
Flags: needinfo?(wcosta)
Resolution: FIXED → ---
I'm not sure if it's related to this bug.  The push to m-c happened 3 days ago, have aires/flame builds been failing for that long?  the error I see in the logs is related to uploading symbols failing.  Wander is is possible that it's related to this new image?  Maybe I'm mistaken.

13:13:26     INFO -  Uploading symbol file "dist/b2g-43.0a1.en-US.android-arm.crashreporter-symbols-full.zip" to "https://crash-stats.mozilla.com/symbols/upload"
13:13:26     INFO -  Attempt 1 of 5...
13:13:27     INFO -  Error: ('Connection broken: IncompleteRead(15 bytes read)', IncompleteRead(15 bytes read))
13:13:27     INFO -  Retrying...
13:13:37     INFO -  Attempt 2 of 5...
13:13:37     INFO -  Error: ('Connection broken: IncompleteRead(15 bytes read)', IncompleteRead(15 bytes read))
13:13:37     INFO -  Retrying...
13:13:52     INFO -  Attempt 3 of 5...
13:13:52     INFO -  Error: ('Connection broken: IncompleteRead(15 bytes read)', IncompleteRead(15 bytes read))
13:13:52     INFO -  Retrying...
13:14:14     INFO -  Attempt 4 of 5...
13:14:15     INFO -  Error: ('Connection broken: IncompleteRead(15 bytes read)', IncompleteRead(15 bytes read))
13:14:15     INFO -  Retrying...
13:14:48     INFO -  Attempt 5 of 5...
13:14:48     INFO -  Error: ('Connection broken: IncompleteRead(15 bytes read)', IncompleteRead(15 bytes read))
13:14:48     INFO -  Retrying...
13:14:48     INFO -  Maximum retries hit, giving up!
(Assignee)

Comment 19

3 years ago
I rebuilt the docker image and tried the build again, it works https://tools.taskcluster.net/task-inspector/#GuIhr4x6TdeyD_KQlJZY2g/0

Tomcat,

Can we try re-applying the patch again? :)
Flags: needinfo?(wcosta) → needinfo?(cbook)
(In reply to Wander Lairson Costa [:wcosta] from comment #19)
> I rebuilt the docker image and tried the build again, it works
> https://tools.taskcluster.net/task-inspector/#GuIhr4x6TdeyD_KQlJZY2g/0
> 
> Tomcat,
> 
> Can we try re-applying the patch again? :)

Hey Wander, i tried to apply this again to mozilla-inbound but i got  applying d8a505066b3b
patching file testing/docker/phone-builder/Dockerfile
Hunk #1 FAILED at 0
1 out of 1 hunks FAILED -- saving rejects to file testing/docker/phone-builder/Dockerfile.rej
could you take a look, thanks!
Flags: needinfo?(cbook) → needinfo?(wcosta)
(Assignee)

Comment 22

3 years ago
(In reply to Carsten Book [:Tomcat] from comment #20)
> (In reply to Wander Lairson Costa [:wcosta] from comment #19)
> > I rebuilt the docker image and tried the build again, it works
> > https://tools.taskcluster.net/task-inspector/#GuIhr4x6TdeyD_KQlJZY2g/0
> > 
> > Tomcat,
> > 
> > Can we try re-applying the patch again? :)
> 
> Hey Wander, i tried to apply this again to mozilla-inbound but i got 
> applying d8a505066b3b
> patching file testing/docker/phone-builder/Dockerfile
> Hunk #1 FAILED at 0
> 1 out of 1 hunks FAILED -- saving rejects to file
> testing/docker/phone-builder/Dockerfile.rej
> could you take a look, thanks!

Another try :)
Flags: needinfo?(wcosta)
https://hg.mozilla.org/mozilla-central/rev/9b6738ca8021
Status: REOPENED → RESOLVED
Last Resolved: 3 years ago3 years ago
Resolution: --- → FIXED
Target Milestone: mozilla43 → mozilla44
You need to log in before you can comment on or make changes to this bug.