Closed Bug 1188813 Opened 4 years ago Closed 4 years ago

Intermittent Gij - make: *** [node_modules] Error 1

Categories

(Testing Graveyard :: JSMarionette, defect)

defect
Not set

Tracking

(firefox42 fixed)

RESOLVED FIXED
mozilla42
Tracking Status
firefox42 --- fixed

People

(Reporter: cbook, Assigned: aus)

References

()

Details

Attachments

(1 file)

This isn't the failure. Bug 1174901 is.
Status: NEW → RESOLVED
Closed: 4 years ago
Resolution: --- → INVALID
Whoops, didn't mean to close this. It's a valid issue happening across various Gij chunks, but not causing test failures.
Status: RESOLVED → REOPENED
Flags: needinfo?(aus)
Resolution: INVALID → ---
Summary: Intermittent Gij 20 - make: *** [node_modules] Error 1 → Intermittent Gij - make: *** [node_modules] Error 1
Yeah, I've seen this a few times as well. It appears to be something odd happening in the copy or build step that happens for sockit-to-me, a dependency of marionette-js-client. I'll try and look at this soon. 

In the meantime, it doesn't seem to be causing crazy amounts of retries at least.
Flags: needinfo?(aus)
I take that back, now it's acting up fairly frequently, so, that sucks. I'll add debug logging to the step that seems to be failing and see if we can find some answers.
The failure URL that's in this bug isn't correct. :/
This specific error (which often got confused with bug 1174901!) should now be resolved.
Assignee: nobody → aus
Status: REOPENED → ASSIGNED
https://hg.mozilla.org/mozilla-central/rev/b8167e33f68f
Status: ASSIGNED → RESOLVED
Closed: 4 years ago4 years ago
Resolution: --- → FIXED
Target Milestone: --- → mozilla42
Product: Testing → Testing Graveyard
You need to log in before you can comment on or make changes to this bug.