Closed Bug 1275215 Opened 3 years ago Closed 2 years ago

Linux64 nightly build busted @ make_pkg : Error while running startup cache precompilation

Categories

(SeaMonkey :: Build Config, defect)

defect
Not set

Tracking

(Not tracked)

RESOLVED FIXED

People

(Reporter: ewong, Unassigned)

Details

Current linux64 nightly build bustage:

resource://gre/components/htmlMenuBuilder.js
resource://gre/components/httpd.js
Traceback (most recent call last):
  File "/builds/slave/c-cen-t-lnx64-ntly/build/mozilla/toolkit/mozapps/installer/packager.py", line 415, in <module>
    main()
  File "/builds/slave/c-cen-t-lnx64-ntly/build/mozilla/toolkit/mozapps/installer/packager.py", line 409, in main
    args.source, gre_path, base)
  File "/builds/slave/c-cen-t-lnx64-ntly/build/mozilla/toolkit/mozapps/installer/packager.py", line 166, in precompile_cache
    errors.fatal('Error while running startup cache precompilation')
  File "/builds/slave/c-cen-t-lnx64-ntly/build/mozilla/python/mozbuild/mozpack/errors.py", line 103, in fatal
    self._handle(self.FATAL, msg)
  File "/builds/slave/c-cen-t-lnx64-ntly/build/mozilla/python/mozbuild/mozpack/errors.py", line 98, in _handle
    raise ErrorMessage(msg)
mozpack.errors.ErrorMessage: Error: Error while running startup cache precompilation
make[3]: *** [stage-package] Error 1
make[2]: *** [make-package] Error 2

Linux64 build is ok.  Just the nightly is busted.  Just filing this
just in case the next nightly is a bustage.  (Though the previous two
Linux64 nightly were bustages, they busted at different steps.)

  May 23 : busted at make package tests
  May 24 : busted at make package.
Ist this still a problem?
Flags: needinfo?(ewong)
(In reply to Frank-Rainer Grahl (:frg) from comment #1)
> Ist this still a problem?

Nope..  fixed by Ratty and his disable-startup-cache thingy.. though I think
it's more or less irrelevant.
Status: NEW → RESOLVED
Closed: 2 years ago
Flags: needinfo?(ewong)
Resolution: --- → FIXED
You need to log in before you can comment on or make changes to this bug.