Closed Bug 1442605 Opened 5 years ago Closed 5 years ago

Windows32 bustage: Hacl_Chacha20_Vec128.c: error C2719: 'v3': formal parameter with requested alignment of 16 won't be aligned

Categories

(SeaMonkey :: Build Config, defect)

defect
Not set
normal

Tracking

(Not tracked)

RESOLVED DUPLICATE of bug 1442554

People

(Reporter: ewong, Unassigned)

Details

c:/builds/slave/c-c-win32/build/objdir/_virtualenv/Scripts/python.exe -m mozbuild.action.cl  c:/builds/slave/c-c-win32/build/vs2015u3/VC/bin/amd64_x86/cl.exe -Fojarfile.obj -c -DNDEBUG -DTRIMMED=1 -DMOZILLA_CLIENT=1 -DNSS_FIPS_DISABLED -DNSS_NO_INIT_SUPPORT -DNSS_X86_OR_X64 -DNSS_X86 -DUSE_UTIL_DIRECTLY -DNO_NSPR_10_SUPPORT -DSSL_DISABLE_DEPRECATED_CIPHER_SUITE_NAMES -D_WINDOWS -DWIN95 -D_CRT_SECURE_NO_WARNINGS -D_CRT_NONSTDC_NO_WARNINGS -DNSS_DISABLE_LIBPKIX -DWIN32 -Ic:/builds/slave/c-c-win32/build/mozilla/security/nss/lib/jar -Ic:/builds/slave/c-c-win32/build/objdir/security/nss/lib/jar/jar_jar -Ic:/builds/slave/c-c-win32/build/objdir/dist/include/nspr -Ic:/builds/slave/c-c-win32/build/objdir/dist/include/private/nss -Ic:/builds/slave/c-c-win32/build/objdir/dist/include/nss -Ic:/builds/slave/c-c-win32/build/objdir/dist/include -MD -FI c:/builds/slave/c-c-win32/build/objdir/mozilla-config.h -DMOZILLA_CLIENT -utf-8 -TC -nologo -wd4091 -D_HAS_EXCEPTIONS=0 -W3 -Gy -Zc:inline -arch:SSE2 -Gw -wd4244 -wd4267 -we4553 -Zi -O1 -Oi -Oy-    -Fdgenerated.pdb -FS  c:/builds/slave/c-c-win32/build/mozilla/security/nss/lib/jar/jarfile.c
c:/builds/slave/c-c-win32/build/objdir/_virtualenv/Scripts/python.exe -m mozbuild.action.cl  c:/builds/slave/c-c-win32/build/vs2015u3/VC/bin/amd64_x86/cl.exe -Fojarint.obj -c -DNDEBUG -DTRIMMED=1 -DMOZILLA_CLIENT=1 -DNSS_FIPS_DISABLED -DNSS_NO_INIT_SUPPORT -DNSS_X86_OR_X64 -DNSS_X86 -DUSE_UTIL_DIRECTLY -DNO_NSPR_10_SUPPORT -DSSL_DISABLE_DEPRECATED_CIPHER_SUITE_NAMES -D_WINDOWS -DWIN95 -D_CRT_SECURE_NO_WARNINGS -D_CRT_NONSTDC_NO_WARNINGS -DNSS_DISABLE_LIBPKIX -DWIN32 -Ic:/builds/slave/c-c-win32/build/mozilla/security/nss/lib/jar -Ic:/builds/slave/c-c-win32/build/objdir/security/nss/lib/jar/jar_jar -Ic:/builds/slave/c-c-win32/build/objdir/dist/include/nspr -Ic:/builds/slave/c-c-win32/build/objdir/dist/include/private/nss -Ic:/builds/slave/c-c-win32/build/objdir/dist/include/nss -Ic:/builds/slave/c-c-win32/build/objdir/dist/include -MD -FI c:/builds/slave/c-c-win32/build/objdir/mozilla-config.h -DMOZILLA_CLIENT -utf-8 -TC -nologo -wd4091 -D_HAS_EXCEPTIONS=0 -W3 -Gy -Zc:inline -arch:SSE2 -Gw -wd4244 -wd4267 -we4553 -Zi -O1 -Oi -Oy-    -Fdgenerated.pdb -FS  c:/builds/slave/c-c-win32/build/mozilla/security/nss/lib/jar/jarint.c
Traceback (most recent call last):
  File "c:/builds/slave/c-c-win32/build/mozilla/config/printconfigsetting.py", line 16, in <module>
    with open(file) as fh:
IOError: [Errno 2] No such file or directory: 'dist/bin/platform.ini'
c:/builds/slave/c-c-win32/build/objdir/_virtualenv/Scripts/python.exe -m mozbuild.action.cl  c:/builds/slave/c-c-win32/build/vs2015u3/VC/bin/amd64_x86/cl.exe -Fojarsign.obj -c -DNDEBUG -DTRIMMED=1 -DMOZILLA_CLIENT=1 -DNSS_FIPS_DISABLED -DNSS_NO_INIT_SUPPORT -DNSS_X86_OR_X64 -DNSS_X86 -DUSE_UTIL_DIRECTLY -DNO_NSPR_10_SUPPORT -DSSL_DISABLE_DEPRECATED_CIPHER_SUITE_NAMES -D_WINDOWS -DWIN95 -D_CRT_SECURE_NO_WARNINGS -D_CRT_NONSTDC_NO_WARNINGS -DNSS_DISABLE_LIBPKIX -DWIN32 -Ic:/builds/slave/c-c-win32/build/mozilla/security/nss/lib/jar -Ic:/builds/slave/c-c-win32/build/objdir/security/nss/lib/jar/jar_jar -Ic:/builds/slave/c-c-win32/build/objdir/dist/include/nspr -Ic:/builds/slave/c-c-win32/build/objdir/dist/include/private/nss -Ic:/builds/slave/c-c-win32/build/objdir/dist/include/nss -Ic:/builds/slave/c-c-win32/build/objdir/dist/include -MD -FI c:/builds/slave/c-c-win32/build/objdir/mozilla-config.h -DMOZILLA_CLIENT -utf-8 -TC -nologo -wd4091 -D_HAS_EXCEPTIONS=0 -W3 -Gy -Zc:inline -arch:SSE2 -Gw -wd4244 -wd4267 -we4553 -Zi -O1 -Oi -Oy-    -Fdgenerated.pdb -FS  c:/builds/slave/c-c-win32/build/mozilla/security/nss/lib/jar/jarsign.c
c:/builds/slave/c-c-win32/build/objdir/_virtualenv/Scripts/python.exe -m mozbuild.action.cl  c:/builds/slave/c-c-win32/build/vs2015u3/VC/bin/amd64_x86/cl.exe -Fojarver.obj -c -DNDEBUG -DTRIMMED=1 -DMOZILLA_CLIENT=1 -DNSS_FIPS_DISABLED -DNSS_NO_INIT_SUPPORT -DNSS_X86_OR_X64 -DNSS_X86 -DUSE_UTIL_DIRECTLY -DNO_NSPR_10_SUPPORT -DSSL_DISABLE_DEPRECATED_CIPHER_SUITE_NAMES -D_WINDOWS -DWIN95 -D_CRT_SECURE_NO_WARNINGS -D_CRT_NONSTDC_NO_WARNINGS -DNSS_DISABLE_LIBPKIX -DWIN32 -Ic:/builds/slave/c-c-win32/build/mozilla/security/nss/lib/jar -Ic:/builds/slave/c-c-win32/build/objdir/security/nss/lib/jar/jar_jar -Ic:/builds/slave/c-c-win32/build/objdir/dist/include/nspr -Ic:/builds/slave/c-c-win32/build/objdir/dist/include/private/nss -Ic:/builds/slave/c-c-win32/build/objdir/dist/include/nss -Ic:/builds/slave/c-c-win32/build/objdir/dist/include -MD -FI c:/builds/slave/c-c-win32/build/objdir/mozilla-config.h -DMOZILLA_CLIENT -utf-8 -TC -nologo -wd4091 -D_HAS_EXCEPTIONS=0 -W3 -Gy -Zc:inline -arch:SSE2 -Gw -wd4244 -wd4267 -we4553 -Zi -O1 -Oi -Oy-    -Fdgenerated.pdb -FS  c:/builds/slave/c-c-win32/build/mozilla/security/nss/lib/jar/jarver.c
mozmake.exe[4]: Entering directory 'c:/builds/slave/c-c-win32/build/objdir/security/nss/lib/zlib/zlib_nss_zlib'
mkdir -p '.deps/'
c:/builds/slave/c-c-win32/build/objdir/_virtualenv/Scripts/python.exe -m mozbuild.action.cl  c:/builds/slave/c-c-win32/build/vs2015u3/VC/bin/amd64_x86/cl.exe -Foadler32.obj -c -DNDEBUG -DTRIMMED=1 -DNSS_FIPS_DISABLED -DNSS_NO_INIT_SUPPORT -DNSS_X86_OR_X64 -DNSS_X86 -Dverbose=-1 -DUSE_UTIL_DIRECTLY -DNO_NSPR_10_SUPPORT -DSSL_DISABLE_DEPRECATED_CIPHER_SUITE_NAMES -D_WINDOWS -DWIN95 -D_CRT_SECURE_NO_WARNINGS -D_CRT_NONSTDC_NO_WARNINGS -DNSS_DISABLE_LIBPKIX -DWIN32 -Ic:/builds/slave/c-c-win32/build/mozilla/security/nss/lib/zlib -Ic:/builds/slave/c-c-win32/build/objdir/security/nss/lib/zlib/zlib_nss_zlib -Ic:/builds/slave/c-c-win32/build/objdir/dist/include/nspr -Ic:/builds/slave/c-c-win32/build/objdir/dist/include/private/nss -Ic:/builds/slave/c-c-win32/build/objdir/dist/include -MD -FI c:/builds/slave/c-c-win32/build/objdir/mozilla-config.h -DMOZILLA_CLIENT -utf-8 -TC -nologo -wd4091 -D_HAS_EXCEPTIONS=0 -W3 -Gy -Zc:inline -arch:SSE2 -Gw -wd4244 -wd4267 -we4553 -Zi -O1 -Oi -Oy-    -Fdgenerated.pdb -FS  c:/builds/slave/c-c-win32/build/mozilla/security/nss/lib/zlib/adler32.c
cl : Command line warning D9002 : ignoring unknown option '-mssse3'
Hacl_Chacha20_Vec128.c
c:/builds/slave/c-c-win32/build/mozilla/security/nss/lib/freebl/verified/Hacl_Chacha20_Vec128.c(229): error C2719: 'v3': formal parameter with requested alignment of 16 won't be aligned
c:/builds/slave/c-c-win32/build/mozilla/config/rules.mk:773: recipe for target 'Hacl_Chacha20_Vec128.obj' failed
mozmake.exe[4]: *** [Hacl_Chacha20_Vec128.obj] Error 2
mozmake.exe[4]: Leaving directory 'c:/builds/slave/c-c-win32/build/objdir/security/nss/lib/freebl/freebl_hw-acc-crypto'
c:/builds/slave/c-c-win32/build/mozilla/config/recurse.mk:73: recipe for target 'security/nss/lib/freebl/freebl_hw-acc-crypto/target' failed
mozmake.exe[3]: *** [security/nss/lib/freebl/freebl_hw-acc-crypto/target] Error 2
mozmake.exe[3]: *** Waiting for unfinished jobs....
Kai,  can you point out what I am missing?  I don't quite know what this error means.
Flags: needinfo?(kaie)
see bug 1442554
Status: NEW → RESOLVED
Closed: 5 years ago
Flags: needinfo?(kaie)
Resolution: --- → DUPLICATE
You need to log in before you can comment on or make changes to this bug.