Build bustages on OS X Cross Compiled - ERROR: Failed to find a linker

RESOLVED FIXED

Status

defect
--
blocker
RESOLVED FIXED
Last year
4 months ago

People

(Reporter: CosminS, Unassigned)

Tracking

Firefox Tracking Flags

(Not tracked)

Details

Trees are closed because of this issue: https://treeherder.mozilla.org/#/jobs?repo=mozilla-central&filter-resultStatus=testfailed&filter-resultStatus=busted&filter-resultStatus=exception&filter-resultStatus=success&filter-classifiedState=unclassified&filter-searchStr=cross&selectedJob=189254788

Failure log: https://treeherder.mozilla.org/logviewer.html#?job_id=189254201&repo=mozilla-central&lineNumber=914

[task 2018-07-20T21:49:53.774Z] 21:49:53     INFO -  checking for 64-bit OS... yes
[task 2018-07-20T21:49:53.774Z] 21:49:53     INFO -  checking bindgen cflags... [u'-target', u'x86_64-apple-darwin11', u'-B', u'/builds/worker/workspace/build/src/cctools/bin', u'-isysroot', u'/builds/worker/workspace/build/src/MacOSX10.11.sdk']
[task 2018-07-20T21:49:53.781Z] 21:49:53     INFO -  checking for linker...
[task 2018-07-20T21:49:53.781Z] 21:49:53     INFO -  DEBUG: Executing: `/builds/worker/workspace/build/src/clang/bin/clang -target x86_64-apple-darwin11 -B /builds/worker/workspace/build/src/cctools/bin -isysroot /builds/worker/workspace/build/src/MacOSX10.11.sdk -std=gnu99 -Wl,--version`
[task 2018-07-20T21:49:53.782Z] 21:49:53     INFO -  ERROR: Failed to find a linker
[task 2018-07-20T21:49:53.809Z] 21:49:53     INFO -  *** Fix above errors and then restart with\
[task 2018-07-20T21:49:53.809Z] 21:49:53     INFO -                 "/usr/bin/make -f client.mk build"
[task 2018-07-20T21:49:53.809Z] 21:49:53     INFO -  client.mk:123: recipe for target 'configure' failed
[task 2018-07-20T21:49:53.809Z] 21:49:53     INFO -  make: *** [configure] Error 1
[task 2018-07-20T21:49:53.884Z] 21:49:53    ERROR - Return code: 2
[task 2018-07-20T21:49:53.884Z] 21:49:53  WARNING - setting return code to 2
[task 2018-07-20T21:49:53.884Z] 21:49:53    FATAL - 'mach build -v' did not run successfully. Please check log for errors.
[task 2018-07-20T21:49:53.884Z] 21:49:53    FATAL - Running post_fatal callback...
[task 2018-07-20T21:49:53.884Z] 21:49:53    FATAL - Exiting -1
[task 2018-07-20T21:49:53.885Z] 21:49:53     INFO - [mozharness: 2018-07-20 21:49:53.885096Z] Finished build step (failed)
[task 2018-07-20T21:49:53.885Z] 21:49:53     INFO - Running post-run listener: _summarize
[task 2018-07-20T21:49:53.885Z] 21:49:53    ERROR - # TBPL FAILURE #
[task 2018-07-20T21:49:53.885Z] 21:49:53     INFO - [mozharness: 2018-07-20 21:49:53.885458Z] FxDesktopBuild summary:
[task 2018-07-20T21:49:53.885Z] 21:49:53    ERROR - # TBPL FAILURE #
[task 2018-07-20T21:49:53.885Z] 21:49:53     INFO - Running post-run listener: copy_logs_to_upload_dir
[task 2018-07-20T21:49:53.885Z] 21:49:53     INFO - Copying logs to upload dir...
Status: NEW → RESOLVED
Closed: 4 months ago
Resolution: --- → FIXED
You need to log in before you can comment on or make changes to this bug.