Closed Bug 1629024 Opened 4 months ago Closed 4 months ago

Perma **/checkouts/gecko/gfx/thebes/gfxPlatform.cpp:3126:24: error: no viable conversion from 'const nsLiteralString' (aka 'const nsTLiteralString<char16_t>') to 'const nsACString' (aka 'const nsTSubstring<char>') when Gecko 77 merges to Beta on 20

Categories

(Core :: Graphics, defect, P1)

defect

Tracking

()

VERIFIED FIXED
mozilla77
Tracking Status
firefox-esr68 --- unaffected
firefox74 --- unaffected
firefox75 --- unaffected
firefox76 + fixed
firefox77 + verified

People

(Reporter: stefan_hindli, Assigned: kvark)

References

(Regression)

Details

(Keywords: regression)

Attachments

(2 files)

[Tracking Requested - why for this release]:

Central as beta simulations: https://treeherder.mozilla.org/#/jobs?repo=try&resultStatus=testfailed%2Cbusted%2Cexception%2Cretry%2Cusercancel%2Crunnable&revision=f9fcaeeef95b361737154290356d650f008c787b&selectedJob=297128784

https://treeherder.mozilla.org/logviewer.html#/jobs?job_id=297128760&repo=try&lineNumber=29615

https://firefoxci.taskcluster-artifacts.net/N-zvWzaESAelYuaDKebrVg/0/public/logs/live_backing.log

[task 2020-04-10T11:10:10.821Z] 11:10:10 INFO - make[4]: Entering directory '/builds/worker/workspace/obj-build/gfx/layers'
[task 2020-04-10T11:10:10.821Z] 11:10:10 INFO - gfx/layers/ShadowLayerUtilsX11.o
[task 2020-04-10T11:10:10.822Z] 11:10:10 INFO - make[4]: Leaving directory '/builds/worker/workspace/obj-build/gfx/layers'
[task 2020-04-10T11:10:11.784Z] 11:10:11 INFO - make[4]: Entering directory '/builds/worker/workspace/obj-build/gfx/layers'
[task 2020-04-10T11:10:11.785Z] 11:10:11 INFO - /builds/worker/fetches/sccache/sccache /builds/worker/fetches/gcc/bin/g++ -std=gnu++17 -o TextureClientX11.o -c -I/builds/worker/workspace/obj-build/dist/stl_wrappers -I/builds/worker/workspace/obj-build/dist/system_wrappers -include /builds/worker/checkouts/gecko/config/gcc_hidden.h -U_FORTIFY_SOURCE -D_FORTIFY_SOURCE=2 -fstack-protector-strong -DNDEBUG=1 -DTRIMMED=1 -DGOOGLE_PROTOBUF_NO_RTTI -DGOOGLE_PROTOBUF_NO_STATIC_INITIALIZER -DOS_POSIX=1 -DOS_LINUX=1 -DMOZ_HAS_MOZGLUE -DMOZILLA_INTERNAL_API -DIMPL_LIBXUL -DSTATIC_EXPORTABLE_JS_API -I/builds/worker/checkouts/gecko/gfx/layers -I/builds/worker/workspace/obj-build/gfx/layers -I/builds/worker/workspace/obj-build/ipc/ipdl/_ipdlheaders -I/builds/worker/checkouts/gecko/ipc/chromium/src -I/builds/worker/checkouts/gecko/ipc/glue -I/builds/worker/checkouts/gecko/docshell/base -I/builds/worker/checkouts/gecko/layout/base -I/builds/worker/checkouts/gecko/layout/generic -I/builds/worker/checkouts/gecko/media/libyuv/libyuv/include -I/builds/worker/checkouts/gecko/gfx/skia -I/builds/worker/checkouts/gecko/gfx/skia/skia -I/builds/worker/workspace/obj-build/dist/include -I/builds/worker/workspace/obj-build/dist/include/nspr -I/builds/worker/workspace/obj-build/dist/include/nss -fPIC -DMOZILLA_CLIENT -include /builds/worker/workspace/obj-build/mozilla-config.h -Wall -Wempty-body -Wignored-qualifiers -Woverloaded-virtual -Wpointer-arith -Wsign-compare -Wtype-limits -Wunreachable-code -Wwrite-strings -Wno-invalid-offsetof -Wduplicated-cond -Wimplicit-fallthrough -Wunused-function -Wunused-variable -Wno-error=maybe-uninitialized -Wno-error=deprecated-declarations -Wno-error=array-bounds -Wno-error=coverage-mismatch -Wno-error=free-nonheap-object -Wformat -Wformat-overflow=2 -D_GLIBCXX_USE_CXX11_ABI=0 -fno-sized-deallocation -fno-aligned-new -fno-exceptions -fno-strict-aliasing -fno-rtti -ffunction-sections -fdata-sections -fno-exceptions -fno-math-errno -pthread -pipe -g -freorder-blocks -O2 -fno-omit-frame-pointer -funwind-tables -Werror -I/builds/worker/workspace/obj-build/dist/include/cairo -I/builds/worker/checkouts/gecko/widget/gtk/compat-gtk3 -pthread -I/usr/include/gtk-3.0 -I/usr/include/pango-1.0 -I/usr/include/gio-unix-2.0/ -I/usr/include/atk-1.0 -I/usr/include/cairo -I/usr/include/gdk-pixbuf-2.0 -I/usr/include/freetype2 -I/usr/include/glib-2.0 -I/usr/lib/x86_64-linux-gnu/glib-2.0/include -I/usr/include/pixman-1 -I/usr/include/libpng12 -I/usr/include/gtk-3.0/unix-print -Wno-error=shadow -Wno-maybe-uninitialized -MD -MP -MF .deps/TextureClientX11.o.pp /builds/worker/checkouts/gecko/gfx/layers/basic/TextureClientX11.cpp
[task 2020-04-10T11:10:11.785Z] 11:10:11 INFO - make[4]: Leaving directory '/builds/worker/workspace/obj-build/gfx/layers'
[task 2020-04-10T11:10:11.785Z] 11:10:11 INFO - make[4]: Entering directory '/builds/worker/workspace/obj-build/gfx/layers'
[task 2020-04-10T11:10:11.785Z] 11:10:11 INFO - gfx/layers/X11TextureSourceOGL.o
[task 2020-04-10T11:10:11.786Z] 11:10:11 INFO - make[4]: Leaving directory '/builds/worker/workspace/obj-build/gfx/layers'
[task 2020-04-10T11:10:11.821Z] 11:10:11 INFO - make[4]: Entering directory '/builds/worker/workspace/obj-build/dom/abort'
[task 2020-04-10T11:10:11.823Z] 11:10:11 INFO - /builds/worker/fetches/sccache/sccache /builds/worker/fetches/gcc/bin/g++ -std=gnu++17 -o Unified_cpp_dom_abort0.o -c -I/builds/worker/workspace/obj-build/dist/stl_wrappers -I/builds/worker/workspace/obj-build/dist/system_wrappers -include /builds/worker/checkouts/gecko/config/gcc_hidden.h -U_FORTIFY_SOURCE -D_FORTIFY_SOURCE=2 -fstack-protector-strong -DNDEBUG=1 -DTRIMMED=1 -DOS_POSIX=1 -DOS_LINUX=1 -DMOZ_HAS_MOZGLUE -DMOZILLA_INTERNAL_API -DIMPL_LIBXUL -DSTATIC_EXPORTABLE_JS_API -I/builds/worker/checkouts/gecko/dom/abort -I/builds/worker/workspace/obj-build/dom/abort -I/builds/worker/workspace/obj-build/ipc/ipdl/_ipdlheaders -I/builds/worker/checkouts/gecko/ipc/chromium/src -I/builds/worker/checkouts/gecko/ipc/glue -I/builds/worker/workspace/obj-build/dist/include -I/builds/worker/workspace/obj-build/dist/include/nspr -I/builds/worker/workspace/obj-build/dist/include/nss -fPIC -DMOZILLA_CLIENT -include /builds/worker/workspace/obj-build/mozilla-config.h -Wall -Wempty-body -Wignored-qualifiers -Woverloaded-virtual -Wpointer-arith -Wsign-compare -Wtype-limits -Wunreachable-code -Wwrite-strings -Wno-invalid-offsetof -Wduplicated-cond -Wimplicit-fallthrough -Wunused-function -Wunused-variable -Wno-error=maybe-uninitialized -Wno-error=deprecated-declarations -Wno-error=array-bounds -Wno-error=coverage-mismatch -Wno-error=free-nonheap-object -Wformat -Wformat-overflow=2 -D_GLIBCXX_USE_CXX11_ABI=0 -fno-sized-deallocation -fno-aligned-new -fno-exceptions -fno-strict-aliasing -fno-rtti -ffunction-sections -fdata-sections -fno-exceptions -fno-math-errno -pthread -pipe -g -freorder-blocks -O2 -fno-omit-frame-pointer -funwind-tables -Werror -MD -MP -MF .deps/Unified_cpp_dom_abort0.o.pp Unified_cpp_dom_abort0.cpp
[task 2020-04-10T11:10:11.823Z] 11:10:11 INFO - make[4]: Leaving directory '/builds/worker/workspace/obj-build/dom/abort'
[task 2020-04-10T11:10:11.823Z] 11:10:11 INFO - make[4]: Entering directory '/builds/worker/workspace/obj-build/gfx/layers'
[task 2020-04-10T11:10:11.823Z] 11:10:11 INFO - gfx/layers/LayerScopePacket.pb.o
[task 2020-04-10T11:10:11.823Z] 11:10:11 INFO - make[4]: Leaving directory '/builds/worker/workspace/obj-build/gfx/layers'
[task 2020-04-10T11:10:12.173Z] 11:10:12 INFO - make[4]: Entering directory '/builds/worker/workspace/obj-build/gfx/layers'
[task 2020-04-10T11:10:12.175Z] 11:10:12 INFO - /builds/worker/fetches/sccache/sccache /builds/worker/fetches/gcc/bin/g++ -std=gnu++17 -o LayerScopePacket.pb.o -c -I/builds/worker/workspace/obj-build/dist/stl_wrappers -I/builds/worker/workspace/obj-build/dist/system_wrappers -include /builds/worker/checkouts/gecko/config/gcc_hidden.h -U_FORTIFY_SOURCE -D_FORTIFY_SOURCE=2 -fstack-protector-strong -DNDEBUG=1 -DTRIMMED=1 -DGOOGLE_PROTOBUF_NO_RTTI -DGOOGLE_PROTOBUF_NO_STATIC_INITIALIZER -DOS_POSIX=1 -DOS_LINUX=1 -DMOZ_HAS_MOZGLUE -DMOZILLA_INTERNAL_API -DIMPL_LIBXUL -DSTATIC_EXPORTABLE_JS_API -I/builds/worker/checkouts/gecko/gfx/layers -I/builds/worker/workspace/obj-build/gfx/layers -I/builds/worker/workspace/obj-build/ipc/ipdl/_ipdlheaders -I/builds/worker/checkouts/gecko/ipc/chromium/src -I/builds/worker/checkouts/gecko/ipc/glue -I/builds/worker/checkouts/gecko/docshell/base -I/builds/worker/checkouts/gecko/layout/base -I/builds/worker/checkouts/gecko/layout/generic -I/builds/worker/checkouts/gecko/media/libyuv/libyuv/include -I/builds/worker/checkouts/gecko/gfx/skia -I/builds/worker/checkouts/gecko/gfx/skia/skia -I/builds/worker/workspace/obj-build/dist/include -I/builds/worker/workspace/obj-build/dist/include/nspr -I/builds/worker/workspace/obj-build/dist/include/nss -fPIC -DMOZILLA_CLIENT -include /builds/worker/workspace/obj-build/mozilla-config.h -Wall -Wempty-body -Wignored-qualifiers -Woverloaded-virtual -Wpointer-arith -Wsign-compare -Wtype-limits -Wunreachable-code -Wwrite-strings -Wno-invalid-offsetof -Wduplicated-cond -Wimplicit-fallthrough -Wunused-function -Wunused-variable -Wno-error=maybe-uninitialized -Wno-error=deprecated-declarations -Wno-error=array-bounds -Wno-error=coverage-mismatch -Wno-error=free-nonheap-object -Wformat -Wformat-overflow=2 -D_GLIBCXX_USE_CXX11_ABI=0 -fno-sized-deallocation -fno-aligned-new -fno-exceptions -fno-strict-aliasing -fno-rtti -ffunction-sections -fdata-sections -fno-exceptions -fno-math-errno -pthread -pipe -g -freorder-blocks -O2 -fno-omit-frame-pointer -funwind-tables -Werror -I/builds/worker/workspace/obj-build/dist/include/cairo -I/builds/worker/checkouts/gecko/widget/gtk/compat-gtk3 -pthread -I/usr/include/gtk-3.0 -I/usr/include/pango-1.0 -I/usr/include/gio-unix-2.0/ -I/usr/include/atk-1.0 -I/usr/include/cairo -I/usr/include/gdk-pixbuf-2.0 -I/usr/include/freetype2 -I/usr/include/glib-2.0 -I/usr/lib/x86_64-linux-gnu/glib-2.0/include -I/usr/include/pixman-1 -I/usr/include/libpng12 -I/usr/include/gtk-3.0/unix-print -Wno-error=shadow -Wno-maybe-uninitialized -MD -MP -MF .deps/LayerScopePacket.pb.o.pp /builds/worker/checkouts/gecko/gfx/layers/protobuf/LayerScopePacket.pb.cc
[task 2020-04-10T11:10:12.176Z] 11:10:12 INFO - make[4]: Leaving directory '/builds/worker/workspace/obj-build/gfx/layers'
[task 2020-04-10T11:10:12.176Z] 11:10:12 INFO - make[4]: Entering directory '/builds/worker/workspace/obj-build/gfx/layers'
[task 2020-04-10T11:10:12.176Z] 11:10:12 INFO - gfx/layers/WebRenderTextureHost.o
[task 2020-04-10T11:10:12.176Z] 11:10:12 INFO - make[4]: Leaving directory '/builds/worker/workspace/obj-build/gfx/layers'
[task 2020-04-10T11:10:12.236Z] 11:10:12 INFO - make[4]: Entering directory '/builds/worker/workspace/obj-build/gfx/layers'
[task 2020-04-10T11:10:12.237Z] 11:10:12 INFO - /builds/worker/fetches/sccache/sccache /builds/worker/fetches/gcc/bin/g++ -std=gnu++17 -o Unified_cpp_gfx_layers9.o -c -I/builds/worker/workspace/obj-build/dist/stl_wrappers -I/builds/worker/workspace/obj-build/dist/system_wrappers -include /builds/worker/checkouts/gecko/config/gcc_hidden.h -U_FORTIFY_SOURCE -D_FORTIFY_SOURCE=2 -fstack-protector-strong -DNDEBUG=1 -DTRIMMED=1 -DGOOGLE_PROTOBUF_NO_RTTI -DGOOGLE_PROTOBUF_NO_STATIC_INITIALIZER -DOS_POSIX=1 -DOS_LINUX=1 -DMOZ_HAS_MOZGLUE -DMOZILLA_INTERNAL_API -DIMPL_LIBXUL -DSTATIC_EXPORTABLE_JS_API -I/builds/worker/checkouts/gecko/gfx/layers -I/builds/worker/workspace/obj-build/gfx/layers -I/builds/worker/workspace/obj-build/ipc/ipdl/_ipdlheaders -I/builds/worker/checkouts/gecko/ipc/chromium/src -I/builds/worker/checkouts/gecko/ipc/glue -I/builds/worker/checkouts/gecko/docshell/base -I/builds/worker/checkouts/gecko/layout/base -I/builds/worker/checkouts/gecko/layout/generic -I/builds/worker/checkouts/gecko/media/libyuv/libyuv/include -I/builds/worker/checkouts/gecko/gfx/skia -I/builds/worker/checkouts/gecko/gfx/skia/skia -I/builds/worker/workspace/obj-build/dist/include -I/builds/worker/workspace/obj-build/dist/include/nspr -I/builds/worker/workspace/obj-build/dist/include/nss -fPIC -DMOZILLA_CLIENT -include /builds/worker/workspace/obj-build/mozilla-config.h -Wall -Wempty-body -Wignored-qualifiers -Woverloaded-virtual -Wpointer-arith -Wsign-compare -Wtype-limits -Wunreachable-code -Wwrite-strings -Wno-invalid-offsetof -Wduplicated-cond -Wimplicit-fallthrough -Wunused-function -Wunused-variable -Wno-error=maybe-uninitialized -Wno-error=deprecated-declarations -Wno-error=array-bounds -Wno-error=coverage-mismatch -Wno-error=free-nonheap-object -Wformat -Wformat-overflow=2 -D_GLIBCXX_USE_CXX11_ABI=0 -fno-sized-deallocation -fno-aligned-new -fno-exceptions -fno-strict-aliasing -fno-rtti -ffunction-sections -fdata-sections -fno-exceptions -fno-math-errno -pthread -pipe -g -freorder-blocks -O2 -fno-omit-frame-pointer -funwind-tables -Werror -I/builds/worker/workspace/obj-build/dist/include/cairo -I/builds/worker/checkouts/gecko/widget/gtk/compat-gtk3 -pthread -I/usr/include/gtk-3.0 -I/usr/include/pango-1.0 -I/usr/include/gio-unix-2.0/ -I/usr/include/atk-1.0 -I/usr/include/cairo -I/usr/include/gdk-pixbuf-2.0 -I/usr/include/freetype2 -I/usr/include/glib-2.0 -I/usr/lib/x86_64-linux-gnu/glib-2.0/include -I/usr/include/pixman-1 -I/usr/include/libpng12 -I/usr/include/gtk-3.0/unix-print -Wno-error=shadow -Wno-maybe-uninitialized -MD -MP -MF .deps/Unified_cpp_gfx_layers9.o.pp Unified_cpp_gfx_layers9.cpp
[task 2020-04-10T11:10:12.238Z] 11:10:12 INFO - make[4]: Leaving directory '/builds/worker/workspace/obj-build/gfx/layers'
[task 2020-04-10T11:10:15.895Z] 11:10:15 INFO - make[4]: Entering directory '/builds/worker/workspace/obj-build/gfx/layers'
[task 2020-04-10T11:10:15.899Z] 11:10:15 INFO - /builds/worker/fetches/sccache/sccache /builds/worker/fetches/gcc/bin/g++ -std=gnu++17 -o X11TextureSourceBasic.o -c -I/builds/worker/workspace/obj-build/dist/stl_wrappers -I/builds/worker/workspace/obj-build/dist/system_wrappers -include /builds/worker/checkouts/gecko/config/gcc_hidden.h -U_FORTIFY_SOURCE -D_FORTIFY_SOURCE=2 -fstack-protector-strong -DNDEBUG=1 -DTRIMMED=1 -DGOOGLE_PROTOBUF_NO_RTTI -DGOOGLE_PROTOBUF_NO_STATIC_INITIALIZER -DOS_POSIX=1 -DOS_LINUX=1 -DMOZ_HAS_MOZGLUE -DMOZILLA_INTERNAL_API -DIMPL_LIBXUL -DSTATIC_EXPORTABLE_JS_API -I/builds/worker/checkouts/gecko/gfx/layers -I/builds/worker/workspace/obj-build/gfx/layers -I/builds/worker/workspace/obj-build/ipc/ipdl/_ipdlheaders -I/builds/worker/checkouts/gecko/ipc/chromium/src -I/builds/worker/checkouts/gecko/ipc/glue -I/builds/worker/checkouts/gecko/docshell/base -I/builds/worker/checkouts/gecko/layout/base -I/builds/worker/checkouts/gecko/layout/generic -I/builds/worker/checkouts/gecko/media/libyuv/libyuv/include -I/builds/worker/checkouts/gecko/gfx/skia -I/builds/worker/checkouts/gecko/gfx/skia/skia -I/builds/worker/workspace/obj-build/dist/include -I/builds/worker/workspace/obj-build/dist/include/nspr -I/builds/worker/workspace/obj-build/dist/include/nss -fPIC -DMOZILLA_CLIENT -include /builds/worker/workspace/obj-build/mozilla-config.h -Wall -Wempty-body -Wignored-qualifiers -Woverloaded-virtual -Wpointer-arith -Wsign-compare -Wtype-limits -Wunreachable-code -Wwrite-strings -Wno-invalid-offsetof -Wduplicated-cond -Wimplicit-fallthrough -Wunused-function -Wunused-variable -Wno-error=maybe-uninitialized -Wno-error=deprecated-declarations -Wno-error=array-bounds -Wno-error=coverage-mismatch -Wno-error=free-nonheap-object -Wformat -Wformat-overflow=2 -D_GLIBCXX_USE_CXX11_ABI=0 -fno-sized-deallocation -fno-aligned-new -fno-exceptions -fno-strict-aliasing -fno-rtti -ffunction-sections -fdata-sections -fno-exceptions -fno-math-errno -pthread -pipe -g -freorder-blocks -O2 -fno-omit-frame-pointer -funwind-tables -Werror -I/builds/worker/workspace/obj-build/dist/include/cairo -I/builds/worker/checkouts/gecko/widget/gtk/compat-gtk3 -pthread -I/usr/include/gtk-3.0 -I/usr/include/pango-1.0 -I/usr/include/gio-unix-2.0/ -I/usr/include/atk-1.0 -I/usr/include/cairo -I/usr/include/gdk-pixbuf-2.0 -I/usr/include/freetype2 -I/usr/include/glib-2.0 -I/usr/lib/x86_64-linux-gnu/glib-2.0/include -I/usr/include/pixman-1 -I/usr/include/libpng12 -I/usr/include/gtk-3.0/unix-print -Wno-error=shadow -Wno-maybe-uninitialized -MD -MP -MF .deps/X11TextureSourceBasic.o.pp /builds/worker/checkouts/gecko/gfx/layers/basic/X11TextureSourceBasic.cpp
[task 2020-04-10T11:10:15.899Z] 11:10:15 INFO - make[4]: Leaving directory '/builds/worker/workspace/obj-build/gfx/layers'
[task 2020-04-10T11:10:15.906Z] 11:10:15 INFO - make[4]: Entering directory '/builds/worker/workspace/obj-build/gfx/layers'
[task 2020-04-10T11:10:15.906Z] 11:10:15 INFO - /builds/worker/fetches/sccache/sccache /builds/worker/fetches/gcc/bin/g++ -std=gnu++17 -o X11BasicCompositor.o -c -I/builds/worker/workspace/obj-build/dist/stl_wrappers -I/builds/worker/workspace/obj-build/dist/system_wrappers -include /builds/worker/checkouts/gecko/config/gcc_hidden.h -U_FORTIFY_SOURCE -D_FORTIFY_SOURCE=2 -fstack-protector-strong -DNDEBUG=1 -DTRIMMED=1 -DGOOGLE_PROTOBUF_NO_RTTI -DGOOGLE_PROTOBUF_NO_STATIC_INITIALIZER -DOS_POSIX=1 -DOS_LINUX=1 -DMOZ_HAS_MOZGLUE -DMOZILLA_INTERNAL_API -DIMPL_LIBXUL -DSTATIC_EXPORTABLE_JS_API -I/builds/worker/checkouts/gecko/gfx/layers -I/builds/worker/workspace/obj-build/gfx/layers -I/builds/worker/workspace/obj-build/ipc/ipdl/_ipdlheaders -I/builds/worker/checkouts/gecko/ipc/chromium/src -I/builds/worker/checkouts/gecko/ipc/glue -I/builds/worker/checkouts/gecko/docshell/base -I/builds/worker/checkouts/gecko/layout/base -I/builds/worker/checkouts/gecko/layout/generic -I/builds/worker/checkouts/gecko/media/libyuv/libyuv/include -I/builds/worker/checkouts/gecko/gfx/skia -I/builds/worker/checkouts/gecko/gfx/skia/skia -I/builds/worker/workspace/obj-build/dist/include -I/builds/worker/workspace/obj-build/dist/include/nspr -I/builds/worker/workspace/obj-build/dist/include/nss -fPIC -DMOZILLA_CLIENT -include /builds/worker/workspace/obj-build/mozilla-config.h -Wall -Wempty-body -Wignored-qualifiers -Woverloaded-virtual -Wpointer-arith -Wsign-compare -Wtype-limits -Wunreachable-code -Wwrite-strings -Wno-invalid-offsetof -Wduplicated-cond -Wimplicit-fallthrough -Wunused-function -Wunused-variable -Wno-error=maybe-uninitialized -Wno-error=deprecated-declarations -Wno-error=array-bounds -Wno-error=coverage-mismatch -Wno-error=free-nonheap-object -Wformat -Wformat-overflow=2 -D_GLIBCXX_USE_CXX11_ABI=0 -fno-sized-deallocation -fno-aligned-new -fno-exceptions -fno-strict-aliasing -fno-rtti -ffunction-sections -fdata-sections -fno-exceptions -fno-math-errno -pthread -pipe -g -freorder-blocks -O2 -fno-omit-frame-pointer -funwind-tables -Werror -I/builds/worker/workspace/obj-build/dist/include/cairo -I/builds/worker/checkouts/gecko/widget/gtk/compat-gtk3 -pthread -I/usr/include/gtk-3.0 -I/usr/include/pango-1.0 -I/usr/include/gio-unix-2.0/ -I/usr/include/atk-1.0 -I/usr/include/cairo -I/usr/include/gdk-pixbuf-2.0 -I/usr/include/freetype2 -I/usr/include/glib-2.0 -I/usr/lib/x86_64-linux-gnu/glib-2.0/include -I/usr/include/pixman-1 -I/usr/include/libpng12 -I/usr/include/gtk-3.0/unix-print -Wno-error=shadow -Wno-maybe-uninitialized -MD -MP -MF .deps/X11BasicCompositor.o.pp /builds/worker/checkouts/gecko/gfx/layers/basic/X11BasicCompositor.cpp
[task 2020-04-10T11:10:15.906Z] 11:10:15 INFO - make[4]: Leaving directory '/builds/worker/workspace/obj-build/gfx/layers'
[task 2020-04-10T11:10:17.901Z] 11:10:17 INFO - make[4]: Entering directory '/builds/worker/workspace/obj-build/gfx/tests/gtest'
[task 2020-04-10T11:10:17.901Z] 11:10:17 INFO - /builds/worker/fetches/sccache/sccache /builds/worker/fetches/gcc/bin/g++ -std=gnu++17 -o Unified_cpp_gfx_tests_gtest1.o -c -I/builds/worker/workspace/obj-build/dist/stl_wrappers -I/builds/worker/workspace/obj-build/dist/system_wrappers -include /builds/worker/checkouts/gecko/config/gcc_hidden.h -U_FORTIFY_SOURCE -D_FORTIFY_SOURCE=2 -fstack-protector-strong -DNDEBUG=1 -DTRIMMED=1 -DOS_POSIX=1 -DOS_LINUX=1 -DMOZ_HAS_MOZGLUE -DMOZILLA_INTERNAL_API -DIMPL_LIBXUL -DSTATIC_EXPORTABLE_JS_API -I/builds/worker/checkouts/gecko/gfx/tests/gtest -I/builds/worker/workspace/obj-build/gfx/tests/gtest -I/builds/worker/workspace/obj-build/ipc/ipdl/_ipdlheaders -I/builds/worker/checkouts/gecko/ipc/chromium/src -I/builds/worker/checkouts/gecko/ipc/glue -I/builds/worker/checkouts/gecko/gfx/2d -I/builds/worker/checkouts/gecko/gfx/2d/unittest -I/builds/worker/checkouts/gecko/gfx/config -I/builds/worker/checkouts/gecko/gfx/layers -I/builds/worker/checkouts/gecko/gfx/ots/src -I/builds/worker/checkouts/gecko/gfx/qcms -I/builds/worker/workspace/obj-build/dist/include -I/builds/worker/workspace/obj-build/dist/include/nspr -I/builds/worker/workspace/obj-build/dist/include/nss -fPIC -DMOZILLA_CLIENT -include /builds/worker/workspace/obj-build/mozilla-config.h -Wall -Wempty-body -Wignored-qualifiers -Woverloaded-virtual -Wpointer-arith -Wsign-compare -Wtype-limits -Wunreachable-code -Wwrite-strings -Wno-invalid-offsetof -Wduplicated-cond -Wimplicit-fallthrough -Wunused-function -Wunused-variable -Wno-error=maybe-uninitialized -Wno-error=deprecated-declarations -Wno-error=array-bounds -Wno-error=coverage-mismatch -Wno-error=free-nonheap-object -Wformat -Wformat-overflow=2 -D_GLIBCXX_USE_CXX11_ABI=0 -fno-sized-deallocation -fno-aligned-new -fno-exceptions -fno-strict-aliasing -fno-rtti -ffunction-sections -fdata-sections -fno-exceptions -fno-math-errno -pthread -pipe -g -freorder-blocks -O2 -fno-omit-frame-pointer -funwind-tables -Werror -I/builds/worker/workspace/obj-build/dist/include/cairo -Wno-error=shadow -MD -MP -MF .deps/Unified_cpp_gfx_tests_gtest1.o.pp Unified_cpp_gfx_tests_gtest1.cpp
[task 2020-04-10T11:10:17.901Z] 11:10:17 INFO - make[4]: Leaving directory '/builds/worker/workspace/obj-build/gfx/tests/gtest'
[task 2020-04-10T11:10:21.145Z] 11:10:21 INFO - make[4]: Entering directory '/builds/worker/workspace/obj-build/image/test/gtest'
[task 2020-04-10T11:10:21.148Z] 11:10:21 INFO - /builds/worker/fetches/sccache/sccache /builds/worker/fetches/gcc/bin/g++ -std=gnu++17 -o TestDownscalingFilterNoSkia.o -c -I/builds/worker/workspace/obj-build/dist/stl_wrappers -I/builds/worker/workspace/obj-build/dist/system_wrappers -include /builds/worker/checkouts/gecko/config/gcc_hidden.h -U_FORTIFY_SOURCE -D_FORTIFY_SOURCE=2 -fstack-protector-strong -DNDEBUG=1 -DTRIMMED=1 -DOS_POSIX=1 -DOS_LINUX=1 -DMOZ_HAS_MOZGLUE -DMOZILLA_INTERNAL_API -DIMPL_LIBXUL -DSTATIC_EXPORTABLE_JS_API -I/builds/worker/checkouts/gecko/image/test/gtest -I/builds/worker/workspace/obj-build/image/test/gtest -I/builds/worker/workspace/obj-build/ipc/ipdl/_ipdlheaders -I/builds/worker/checkouts/gecko/ipc/chromium/src -I/builds/worker/checkouts/gecko/ipc/glue -I/builds/worker/checkouts/gecko/dom/base -I/builds/worker/checkouts/gecko/gfx/2d -I/builds/worker/checkouts/gecko/image -I/builds/worker/checkouts/gecko/gfx/skia -I/builds/worker/checkouts/gecko/gfx/skia/skia -I/builds/worker/workspace/obj-build/dist/include -I/builds/worker/workspace/obj-build/dist/include/nspr -I/builds/worker/workspace/obj-build/dist/include/nss -fPIC -DMOZILLA_CLIENT -include /builds/worker/workspace/obj-build/mozilla-config.h -Wall -Wempty-body -Wignored-qualifiers -Woverloaded-virtual -Wpointer-arith -Wsign-compare -Wtype-limits -Wunreachable-code -Wwrite-strings -Wno-invalid-offsetof -Wduplicated-cond -Wimplicit-fallthrough -Wunused-function -Wunused-variable -Wno-error=maybe-uninitialized -Wno-error=deprecated-declarations -Wno-error=array-bounds -Wno-error=coverage-mismatch -Wno-error=free-nonheap-object -Wformat -Wformat-overflow=2 -D_GLIBCXX_USE_CXX11_ABI=0 -fno-sized-deallocation -fno-aligned-new -fno-exceptions -fno-strict-aliasing -fno-rtti -ffunction-sections -fdata-sections -fno-exceptions -fno-math-errno -pthread -pipe -g -freorder-blocks -O2 -fno-omit-frame-pointer -funwind-tables -Werror -Wno-error=shadow -MD -MP -MF .deps/TestDownscalingFilterNoSkia.o.pp /builds/worker/checkouts/gecko/image/test/gtest/TestDownscalingFilterNoSkia.cpp
[task 2020-04-10T11:10:21.148Z] 11:10:21 INFO - make[4]: Leaving directory '/builds/worker/workspace/obj-build/image/test/gtest'
[task 2020-04-10T11:10:22.695Z] 11:10:22 INFO - make[4]: Entering directory '/builds/worker/workspace/obj-build/gfx/layers'
[task 2020-04-10T11:10:22.696Z] 11:10:22 INFO - /builds/worker/fetches/sccache/sccache /builds/worker/fetches/gcc/bin/g++ -std=gnu++17 -o X11TextureHost.o -c -I/builds/worker/workspace/obj-build/dist/stl_wrappers -I/builds/worker/workspace/obj-build/dist/system_wrappers -include /builds/worker/checkouts/gecko/config/gcc_hidden.h -U_FORTIFY_SOURCE -D_FORTIFY_SOURCE=2 -fstack-protector-strong -DNDEBUG=1 -DTRIMMED=1 -DGOOGLE_PROTOBUF_NO_RTTI -DGOOGLE_PROTOBUF_NO_STATIC_INITIALIZER -DOS_POSIX=1 -DOS_LINUX=1 -DMOZ_HAS_MOZGLUE -DMOZILLA_INTERNAL_API -DIMPL_LIBXUL -DSTATIC_EXPORTABLE_JS_API -I/builds/worker/checkouts/gecko/gfx/layers -I/builds/worker/workspace/obj-build/gfx/layers -I/builds/worker/workspace/obj-build/ipc/ipdl/_ipdlheaders -I/builds/worker/checkouts/gecko/ipc/chromium/src -I/builds/worker/checkouts/gecko/ipc/glue -I/builds/worker/checkouts/gecko/docshell/base -I/builds/worker/checkouts/gecko/layout/base -I/builds/worker/checkouts/gecko/layout/generic -I/builds/worker/checkouts/gecko/media/libyuv/libyuv/include -I/builds/worker/checkouts/gecko/gfx/skia -I/builds/worker/checkouts/gecko/gfx/skia/skia -I/builds/worker/workspace/obj-build/dist/include -I/builds/worker/workspace/obj-build/dist/include/nspr -I/builds/worker/workspace/obj-build/dist/include/nss -fPIC -DMOZILLA_CLIENT -include /builds/worker/workspace/obj-build/mozilla-config.h -Wall -Wempty-body -Wignored-qualifiers -Woverloaded-virtual -Wpointer-arith -Wsign-compare -Wtype-limits -Wunreachable-code -Wwrite-strings -Wno-invalid-offsetof -Wduplicated-cond -Wimplicit-fallthrough -Wunused-function -Wunused-variable -Wno-error=maybe-uninitialized -Wno-error=deprecated-declarations -Wno-error=array-bounds -Wno-error=coverage-mismatch -Wno-error=free-nonheap-object -Wformat -Wformat-overflow=2 -D_GLIBCXX_USE_CXX11_ABI=0 -fno-sized-deallocation -fno-aligned-new -fno-exceptions -fno-strict-aliasing -fno-rtti -ffunction-sections -fdata-sections -fno-exceptions -fno-math-errno -pthread -pipe -g -freorder-blocks -O2 -fno-omit-frame-pointer -funwind-tables -Werror -I/builds/worker/workspace/obj-build/dist/include/cairo -I/builds/worker/checkouts/gecko/widget/gtk/compat-gtk3 -pthread -I/usr/include/gtk-3.0 -I/usr/include/pango-1.0 -I/usr/include/gio-unix-2.0/ -I/usr/include/atk-1.0 -I/usr/include/cairo -I/usr/include/gdk-pixbuf-2.0 -I/usr/include/freetype2 -I/usr/include/glib-2.0 -I/usr/lib/x86_64-linux-gnu/glib-2.0/include -I/usr/include/pixman-1 -I/usr/include/libpng12 -I/usr/include/gtk-3.0/unix-print -Wno-error=shadow -Wno-maybe-uninitialized -MD -MP -MF .deps/X11TextureHost.o.pp /builds/worker/checkouts/gecko/gfx/layers/composite/X11TextureHost.cpp
[task 2020-04-10T11:10:22.696Z] 11:10:22 INFO - make[4]: Leaving directory '/builds/worker/workspace/obj-build/gfx/layers'
[task 2020-04-10T11:10:23.999Z] 11:10:23 INFO - make[4]: Entering directory '/builds/worker/workspace/obj-build/gfx/layers'
[task 2020-04-10T11:10:24.000Z] 11:10:23 INFO - /builds/worker/fetches/sccache/sccache /builds/worker/fetches/gcc/bin/g++ -std=gnu++17 -o TextureClient.o -c -I/builds/worker/workspace/obj-build/dist/stl_wrappers -I/builds/worker/workspace/obj-build/dist/system_wrappers -include /builds/worker/checkouts/gecko/config/gcc_hidden.h -U_FORTIFY_SOURCE -D_FORTIFY_SOURCE=2 -fstack-protector-strong -DNDEBUG=1 -DTRIMMED=1 -DGOOGLE_PROTOBUF_NO_RTTI -DGOOGLE_PROTOBUF_NO_STATIC_INITIALIZER -DOS_POSIX=1 -DOS_LINUX=1 -DMOZ_HAS_MOZGLUE -DMOZILLA_INTERNAL_API -DIMPL_LIBXUL -DSTATIC_EXPORTABLE_JS_API -I/builds/worker/checkouts/gecko/gfx/layers -I/builds/worker/workspace/obj-build/gfx/layers -I/builds/worker/workspace/obj-build/ipc/ipdl/_ipdlheaders -I/builds/worker/checkouts/gecko/ipc/chromium/src -I/builds/worker/checkouts/gecko/ipc/glue -I/builds/worker/checkouts/gecko/docshell/base -I/builds/worker/checkouts/gecko/layout/base -I/builds/worker/checkouts/gecko/layout/generic -I/builds/worker/checkouts/gecko/media/libyuv/libyuv/include -I/builds/worker/checkouts/gecko/gfx/skia -I/builds/worker/checkouts/gecko/gfx/skia/skia -I/builds/worker/workspace/obj-build/dist/include -I/builds/worker/workspace/obj-build/dist/include/nspr -I/builds/worker/workspace/obj-build/dist/include/nss -fPIC -DMOZILLA_CLIENT -include /builds/worker/workspace/obj-build/mozilla-config.h -Wall -Wempty-body -Wignored-qualifiers -Woverloaded-virtual -Wpointer-arith -Wsign-compare -Wtype-limits -Wunreachable-code -Wwrite-strings -Wno-invalid-offsetof -Wduplicated-cond -Wimplicit-fallthrough -Wunused-function -Wunused-variable -Wno-error=maybe-uninitialized -Wno-error=deprecated-declarations -Wno-error=array-bounds -Wno-error=coverage-mismatch -Wno-error=free-nonheap-object -Wformat -Wformat-overflow=2 -D_GLIBCXX_USE_CXX11_ABI=0 -fno-sized-deallocation -fno-aligned-new -fno-exceptions -fno-strict-aliasing -fno-rtti -ffunction-sections -fdata-sections -fno-exceptions -fno-math-errno -pthread -pipe -g -freorder-blocks -O2 -fno-omit-frame-pointer -funwind-tables -Werror -I/builds/worker/workspace/obj-build/dist/include/cairo -I/builds/worker/checkouts/gecko/widget/gtk/compat-gtk3 -pthread -I/usr/include/gtk-3.0 -I/usr/include/pango-1.0 -I/usr/include/gio-unix-2.0/ -I/usr/include/atk-1.0 -I/usr/include/cairo -I/usr/include/gdk-pixbuf-2.0 -I/usr/include/freetype2 -I/usr/include/glib-2.0 -I/usr/lib/x86_64-linux-gnu/glib-2.0/include -I/usr/include/pixman-1 -I/usr/include/libpng12 -I/usr/include/gtk-3.0/unix-print -Wno-error=shadow -Wno-maybe-uninitialized -MD -MP -MF .deps/TextureClient.o.pp /builds/worker/checkouts/gecko/gfx/layers/client/TextureClient.cpp
[task 2020-04-10T11:10:24.000Z] 11:10:24 INFO - make[4]: Leaving directory '/builds/worker/workspace/obj-build/gfx/layers'
[task 2020-04-10T11:10:26.284Z] 11:10:26 INFO - make[4]: Entering directory '/builds/worker/workspace/obj-build/gfx/layers'
[task 2020-04-10T11:10:26.285Z] 11:10:26 INFO - /builds/worker/fetches/sccache/sccache /builds/worker/fetches/gcc/bin/g++ -std=gnu++17 -o X11TextureSourceOGL.o -c -I/builds/worker/workspace/obj-build/dist/stl_wrappers -I/builds/worker/workspace/obj-build/dist/system_wrappers -include /builds/worker/checkouts/gecko/config/gcc_hidden.h -U_FORTIFY_SOURCE -D_FORTIFY_SOURCE=2 -fstack-protector-strong -DNDEBUG=1 -DTRIMMED=1 -DGOOGLE_PROTOBUF_NO_RTTI -DGOOGLE_PROTOBUF_NO_STATIC_INITIALIZER -DOS_POSIX=1 -DOS_LINUX=1 -DMOZ_HAS_MOZGLUE -DMOZILLA_INTERNAL_API -DIMPL_LIBXUL -DSTATIC_EXPORTABLE_JS_API -I/builds/worker/checkouts/gecko/gfx/layers -I/builds/worker/workspace/obj-build/gfx/layers -I/builds/worker/workspace/obj-build/ipc/ipdl/_ipdlheaders -I/builds/worker/checkouts/gecko/ipc/chromium/src -I/builds/worker/checkouts/gecko/ipc/glue -I/builds/worker/checkouts/gecko/docshell/base -I/builds/worker/checkouts/gecko/layout/base -I/builds/worker/checkouts/gecko/layout/generic -I/builds/worker/checkouts/gecko/media/libyuv/libyuv/include -I/builds/worker/checkouts/gecko/gfx/skia -I/builds/worker/checkouts/gecko/gfx/skia/skia -I/builds/worker/workspace/obj-build/dist/include -I/builds/worker/workspace/obj-build/dist/include/nspr -I/builds/worker/workspace/obj-build/dist/include/nss -fPIC -DMOZILLA_CLIENT -include /builds/worker/workspace/obj-build/mozilla-config.h -Wall -Wempty-body -Wignored-qualifiers -Woverloaded-virtual -Wpointer-arith -Wsign-compare -Wtype-limits -Wunreachable-code -Wwrite-strings -Wno-invalid-offsetof -Wduplicated-cond -Wimplicit-fallthrough -Wunused-function -Wunused-variable -Wno-error=maybe-uninitialized -Wno-error=deprecated-declarations -Wno-error=array-bounds -Wno-error=coverage-mismatch -Wno-error=free-nonheap-object -Wformat -Wformat-overflow=2 -D_GLIBCXX_USE_CXX11_ABI=0 -fno-sized-deallocation -fno-aligned-new -fno-exceptions -fno-strict-aliasing -fno-rtti -ffunction-sections -fdata-sections -fno-exceptions -fno-math-errno -pthread -pipe -g -freorder-blocks -O2 -fno-omit-frame-pointer -funwind-tables -Werror -I/builds/worker/workspace/obj-build/dist/include/cairo -I/builds/worker/checkouts/gecko/widget/gtk/compat-gtk3 -pthread -I/usr/include/gtk-3.0 -I/usr/include/pango-1.0 -I/usr/include/gio-unix-2.0/ -I/usr/include/atk-1.0 -I/usr/include/cairo -I/usr/include/gdk-pixbuf-2.0 -I/usr/include/freetype2 -I/usr/include/glib-2.0 -I/usr/lib/x86_64-linux-gnu/glib-2.0/include -I/usr/include/pixman-1 -I/usr/include/libpng12 -I/usr/include/gtk-3.0/unix-print -Wno-error=shadow -Wno-maybe-uninitialized -MD -MP -MF .deps/X11TextureSourceOGL.o.pp /builds/worker/checkouts/gecko/gfx/layers/opengl/X11TextureSourceOGL.cpp
[task 2020-04-10T11:10:26.285Z] 11:10:26 INFO - make[4]: Leaving directory '/builds/worker/workspace/obj-build/gfx/layers'
[task 2020-04-10T11:10:26.380Z] 11:10:26 INFO - make[4]: Entering directory '/builds/worker/workspace/obj-build/gfx/layers'
[task 2020-04-10T11:10:26.381Z] 11:10:26 INFO - /builds/worker/fetches/sccache/sccache /builds/worker/fetches/gcc/bin/g++ -std=gnu++17 -o ShadowLayerUtilsX11.o -c -I/builds/worker/workspace/obj-build/dist/stl_wrappers -I/builds/worker/workspace/obj-build/dist/system_wrappers -include /builds/worker/checkouts/gecko/config/gcc_hidden.h -U_FORTIFY_SOURCE -D_FORTIFY_SOURCE=2 -fstack-protector-strong -DNDEBUG=1 -DTRIMMED=1 -DGOOGLE_PROTOBUF_NO_RTTI -DGOOGLE_PROTOBUF_NO_STATIC_INITIALIZER -DOS_POSIX=1 -DOS_LINUX=1 -DMOZ_HAS_MOZGLUE -DMOZILLA_INTERNAL_API -DIMPL_LIBXUL -DSTATIC_EXPORTABLE_JS_API -I/builds/worker/checkouts/gecko/gfx/layers -I/builds/worker/workspace/obj-build/gfx/layers -I/builds/worker/workspace/obj-build/ipc/ipdl/_ipdlheaders -I/builds/worker/checkouts/gecko/ipc/chromium/src -I/builds/worker/checkouts/gecko/ipc/glue -I/builds/worker/checkouts/gecko/docshell/base -I/builds/worker/checkouts/gecko/layout/base -I/builds/worker/checkouts/gecko/layout/generic -I/builds/worker/checkouts/gecko/media/libyuv/libyuv/include -I/builds/worker/checkouts/gecko/gfx/skia -I/builds/worker/checkouts/gecko/gfx/skia/skia -I/builds/worker/workspace/obj-build/dist/include -I/builds/worker/workspace/obj-build/dist/include/nspr -I/builds/worker/workspace/obj-build/dist/include/nss -fPIC -DMOZILLA_CLIENT -include /builds/worker/workspace/obj-build/mozilla-config.h -Wall -Wempty-body -Wignored-qualifiers -Woverloaded-virtual -Wpointer-arith -Wsign-compare -Wtype-limits -Wunreachable-code -Wwrite-strings -Wno-invalid-offsetof -Wduplicated-cond -Wimplicit-fallthrough -Wunused-function -Wunused-variable -Wno-error=maybe-uninitialized -Wno-error=deprecated-declarations -Wno-error=array-bounds -Wno-error=coverage-mismatch -Wno-error=free-nonheap-object -Wformat -Wformat-overflow=2 -D_GLIBCXX_USE_CXX11_ABI=0 -fno-sized-deallocation -fno-aligned-new -fno-exceptions -fno-strict-aliasing -fno-rtti -ffunction-sections -fdata-sections -fno-exceptions -fno-math-errno -pthread -pipe -g -freorder-blocks -O2 -fno-omit-frame-pointer -funwind-tables -Werror -I/builds/worker/workspace/obj-build/dist/include/cairo -I/builds/worker/checkouts/gecko/widget/gtk/compat-gtk3 -pthread -I/usr/include/gtk-3.0 -I/usr/include/pango-1.0 -I/usr/include/gio-unix-2.0/ -I/usr/include/atk-1.0 -I/usr/include/cairo -I/usr/include/gdk-pixbuf-2.0 -I/usr/include/freetype2 -I/usr/include/glib-2.0 -I/usr/lib/x86_64-linux-gnu/glib-2.0/include -I/usr/include/pixman-1 -I/usr/include/libpng12 -I/usr/include/gtk-3.0/unix-print -Wno-error=shadow -Wno-maybe-uninitialized -MD -MP -MF .deps/ShadowLayerUtilsX11.o.pp /builds/worker/checkouts/gecko/gfx/layers/ipc/ShadowLayerUtilsX11.cpp
[task 2020-04-10T11:10:26.381Z] 11:10:26 INFO - make[4]: Leaving directory '/builds/worker/workspace/obj-build/gfx/layers'
[task 2020-04-10T11:10:26.697Z] 11:10:26 INFO - make[4]: Entering directory '/builds/worker/workspace/obj-build/gfx/layers'
[task 2020-04-10T11:10:26.698Z] 11:10:26 INFO - /builds/worker/fetches/sccache/sccache /builds/worker/fetches/gcc/bin/g++ -std=gnu++17 -o WebRenderTextureHost.o -c -I/builds/worker/workspace/obj-build/dist/stl_wrappers -I/builds/worker/workspace/obj-build/dist/system_wrappers -include /builds/worker/checkouts/gecko/config/gcc_hidden.h -U_FORTIFY_SOURCE -D_FORTIFY_SOURCE=2 -fstack-protector-strong -DNDEBUG=1 -DTRIMMED=1 -DGOOGLE_PROTOBUF_NO_RTTI -DGOOGLE_PROTOBUF_NO_STATIC_INITIALIZER -DOS_POSIX=1 -DOS_LINUX=1 -DMOZ_HAS_MOZGLUE -DMOZILLA_INTERNAL_API -DIMPL_LIBXUL -DSTATIC_EXPORTABLE_JS_API -I/builds/worker/checkouts/gecko/gfx/layers -I/builds/worker/workspace/obj-build/gfx/layers -I/builds/worker/workspace/obj-build/ipc/ipdl/_ipdlheaders -I/builds/worker/checkouts/gecko/ipc/chromium/src -I/builds/worker/checkouts/gecko/ipc/glue -I/builds/worker/checkouts/gecko/docshell/base -I/builds/worker/checkouts/gecko/layout/base -I/builds/worker/checkouts/gecko/layout/generic -I/builds/worker/checkouts/gecko/media/libyuv/libyuv/include -I/builds/worker/checkouts/gecko/gfx/skia -I/builds/worker/checkouts/gecko/gfx/skia/skia -I/builds/worker/workspace/obj-build/dist/include -I/builds/worker/workspace/obj-build/dist/include/nspr -I/builds/worker/workspace/obj-build/dist/include/nss -fPIC -DMOZILLA_CLIENT -include /builds/worker/workspace/obj-build/mozilla-config.h -Wall -Wempty-body -Wignored-qualifiers -Woverloaded-virtual -Wpointer-arith -Wsign-compare -Wtype-limits -Wunreachable-code -Wwrite-strings -Wno-invalid-offsetof -Wduplicated-cond -Wimplicit-fallthrough -Wunused-function -Wunused-variable -Wno-error=maybe-uninitialized -Wno-error=deprecated-declarations -Wno-error=array-bounds -Wno-error=coverage-mismatch -Wno-error=free-nonheap-object -Wformat -Wformat-overflow=2 -D_GLIBCXX_USE_CXX11_ABI=0 -fno-sized-deallocation -fno-aligned-new -fno-exceptions -fno-strict-aliasing -fno-rtti -ffunction-sections -fdata-sections -fno-exceptions -fno-math-errno -pthread -pipe -g -freorder-blocks -O2 -fno-omit-frame-pointer -funwind-tables -Werror -I/builds/worker/workspace/obj-build/dist/include/cairo -I/builds/worker/checkouts/gecko/widget/gtk/compat-gtk3 -pthread -I/usr/include/gtk-3.0 -I/usr/include/pango-1.0 -I/usr/include/gio-unix-2.0/ -I/usr/include/atk-1.0 -I/usr/include/cairo -I/usr/include/gdk-pixbuf-2.0 -I/usr/include/freetype2 -I/usr/include/glib-2.0 -I/usr/lib/x86_64-linux-gnu/glib-2.0/include -I/usr/include/pixman-1 -I/usr/include/libpng12 -I/usr/include/gtk-3.0/unix-print -Wno-error=shadow -Wno-maybe-uninitialized -MD -MP -MF .deps/WebRenderTextureHost.o.pp /builds/worker/checkouts/gecko/gfx/layers/wr/WebRenderTextureHost.cpp
[task 2020-04-10T11:10:26.698Z] 11:10:26 INFO - make[4]: Leaving directory '/builds/worker/workspace/obj-build/gfx/layers'
[task 2020-04-10T11:10:27.135Z] 11:10:27 INFO - make[4]: Entering directory '/builds/worker/workspace/obj-build/image/test/gtest'
[task 2020-04-10T11:10:27.136Z] 11:10:27 INFO - /builds/worker/fetches/sccache/sccache /builds/worker/fetches/gcc/bin/g++ -std=gnu++17 -o Unified_cpp_image_test_gtest1.o -c -I/builds/worker/workspace/obj-build/dist/stl_wrappers -I/builds/worker/workspace/obj-build/dist/system_wrappers -include /builds/worker/checkouts/gecko/config/gcc_hidden.h -U_FORTIFY_SOURCE -D_FORTIFY_SOURCE=2 -fstack-protector-strong -DNDEBUG=1 -DTRIMMED=1 -DOS_POSIX=1 -DOS_LINUX=1 -DMOZ_HAS_MOZGLUE -DMOZILLA_INTERNAL_API -DIMPL_LIBXUL -DSTATIC_EXPORTABLE_JS_API -I/builds/worker/checkouts/gecko/image/test/gtest -I/builds/worker/workspace/obj-build/image/test/gtest -I/builds/worker/workspace/obj-build/ipc/ipdl/_ipdlheaders -I/builds/worker/checkouts/gecko/ipc/chromium/src -I/builds/worker/checkouts/gecko/ipc/glue -I/builds/worker/checkouts/gecko/dom/base -I/builds/worker/checkouts/gecko/gfx/2d -I/builds/worker/checkouts/gecko/image -I/builds/worker/checkouts/gecko/gfx/skia -I/builds/worker/checkouts/gecko/gfx/skia/skia -I/builds/worker/workspace/obj-build/dist/include -I/builds/worker/workspace/obj-build/dist/include/nspr -I/builds/worker/workspace/obj-build/dist/include/nss -fPIC -DMOZILLA_CLIENT -include /builds/worker/workspace/obj-build/mozilla-config.h -Wall -Wempty-body -Wignored-qualifiers -Woverloaded-virtual -Wpointer-arith -Wsign-compare -Wtype-limits -Wunreachable-code -Wwrite-strings -Wno-invalid-offsetof -Wduplicated-cond -Wimplicit-fallthrough -Wunused-function -Wunused-variable -Wno-error=maybe-uninitialized -Wno-error=deprecated-declarations -Wno-error=array-bounds -Wno-error=coverage-mismatch -Wno-error=free-nonheap-object -Wformat -Wformat-overflow=2 -D_GLIBCXX_USE_CXX11_ABI=0 -fno-sized-deallocation -fno-aligned-new -fno-exceptions -fno-strict-aliasing -fno-rtti -ffunction-sections -fdata-sections -fno-exceptions -fno-math-errno -pthread -pipe -g -freorder-blocks -O2 -fno-omit-frame-pointer -funwind-tables -Werror -Wno-error=shadow -MD -MP -MF .deps/Unified_cpp_image_test_gtest1.o.pp Unified_cpp_image_test_gtest1.cpp
[task 2020-04-10T11:10:27.136Z] 11:10:27 INFO - make[4]: Leaving directory '/builds/worker/workspace/obj-build/image/test/gtest'
[task 2020-04-10T11:10:44.044Z] 11:10:44 INFO - make[4]: Entering directory '/builds/worker/workspace/obj-build/image/test/gtest'
[task 2020-04-10T11:10:44.045Z] 11:10:44 INFO - /builds/worker/fetches/sccache/sccache /builds/worker/fetches/gcc/bin/g++ -std=gnu++17 -o Unified_cpp_image_test_gtest0.o -c -I/builds/worker/workspace/obj-build/dist/stl_wrappers -I/builds/worker/workspace/obj-build/dist/system_wrappers -include /builds/worker/checkouts/gecko/config/gcc_hidden.h -U_FORTIFY_SOURCE -D_FORTIFY_SOURCE=2 -fstack-protector-strong -DNDEBUG=1 -DTRIMMED=1 -DOS_POSIX=1 -DOS_LINUX=1 -DMOZ_HAS_MOZGLUE -DMOZILLA_INTERNAL_API -DIMPL_LIBXUL -DSTATIC_EXPORTABLE_JS_API -I/builds/worker/checkouts/gecko/image/test/gtest -I/builds/worker/workspace/obj-build/image/test/gtest -I/builds/worker/workspace/obj-build/ipc/ipdl/_ipdlheaders -I/builds/worker/checkouts/gecko/ipc/chromium/src -I/builds/worker/checkouts/gecko/ipc/glue -I/builds/worker/checkouts/gecko/dom/base -I/builds/worker/checkouts/gecko/gfx/2d -I/builds/worker/checkouts/gecko/image -I/builds/worker/checkouts/gecko/gfx/skia -I/builds/worker/checkouts/gecko/gfx/skia/skia -I/builds/worker/workspace/obj-build/dist/include -I/builds/worker/workspace/obj-build/dist/include/nspr -I/builds/worker/workspace/obj-build/dist/include/nss -fPIC -DMOZILLA_CLIENT -include /builds/worker/workspace/obj-build/mozilla-config.h -Wall -Wempty-body -Wignored-qualifiers -Woverloaded-virtual -Wpointer-arith -Wsign-compare -Wtype-limits -Wunreachable-code -Wwrite-strings -Wno-invalid-offsetof -Wduplicated-cond -Wimplicit-fallthrough -Wunused-function -Wunused-variable -Wno-error=maybe-uninitialized -Wno-error=deprecated-declarations -Wno-error=array-bounds -Wno-error=coverage-mismatch -Wno-error=free-nonheap-object -Wformat -Wformat-overflow=2 -D_GLIBCXX_USE_CXX11_ABI=0 -fno-sized-deallocation -fno-aligned-new -fno-exceptions -fno-strict-aliasing -fno-rtti -ffunction-sections -fdata-sections -fno-exceptions -fno-math-errno -pthread -pipe -g -freorder-blocks -O2 -fno-omit-frame-pointer -funwind-tables -Werror -Wno-error=shadow -MD -MP -MF .deps/Unified_cpp_image_test_gtest0.o.pp Unified_cpp_image_test_gtest0.cpp
[task 2020-04-10T11:10:44.045Z] 11:10:44 INFO - In file included from Unified_cpp_image_test_gtest0.cpp:20:0:
[task 2020-04-10T11:10:44.045Z] 11:10:44 INFO - /builds/worker/checkouts/gecko/image/test/gtest/TestAnimationFrameBuffer.cpp: In function 'void VerifyAdvance(mozilla::image::AnimationFrameBuffer&, size_t, bool)':
[task 2020-04-10T11:10:44.045Z] 11:10:44 WARNING - /builds/worker/checkouts/gecko/image/test/gtest/TestAnimationFrameBuffer.cpp:112:29: warning: 'totalRecycled' may be used uninitialized in this function [-Wmaybe-uninitialized]
[task 2020-04-10T11:10:44.045Z] 11:10:44 INFO - EXPECT_EQ(totalRecycled + 1, queue.Recycle().size());
[task 2020-04-10T11:10:44.045Z] 11:10:44 INFO - ^
[task 2020-04-10T11:10:44.045Z] 11:10:44 INFO - make[4]: Leaving directory '/builds/worker/workspace/obj-build/image/test/gtest'
[task 2020-04-10T11:10:44.045Z] 11:10:44 INFO - /builds/worker/checkouts/gecko/config/recurse.mk:32: recipe for target 'compile' failed
[task 2020-04-10T11:10:44.045Z] 11:10:44 ERROR - make[2]: *** [compile] Error 2
[task 2020-04-10T11:10:44.045Z] 11:10:44 INFO - /builds/worker/checkouts/gecko/config/rules.mk:394: recipe for target 'default' failed
[task 2020-04-10T11:10:44.045Z] 11:10:44 ERROR - make[1]: *** [default] Error 2
[task 2020-04-10T11:10:44.045Z] 11:10:44 INFO - client.mk:125: recipe for target 'build' failed
[task 2020-04-10T11:10:44.045Z] 11:10:44 INFO - make: *** [build] Error 2
[task 2020-04-10T11:10:44.073Z] 11:10:44 INFO - 334 compiler warnings present.
[task 2020-04-10T11:10:44.161Z] 11:10:44 INFO - Notification center failed: Install notify-send (usually part of the libnotify package) to get a notification when the build finishes.
[task 2020-04-10T11:10:44.203Z] 11:10:44 ERROR - Return code: 2
[task 2020-04-10T11:10:44.203Z] 11:10:44 WARNING - setting return code to 2
[task 2020-04-10T11:10:44.203Z] 11:10:44 FATAL - 'mach build -v' did not run successfully. Please check log for errors.
[task 2020-04-10T11:10:44.203Z] 11:10:44 FATAL - Running post_fatal callback...
[task 2020-04-10T11:10:44.203Z] 11:10:44 FATAL - Exiting -1
[task 2020-04-10T11:10:44.203Z] 11:10:44 INFO - [mozharness: 2020-04-10 11:10:44.203567Z] Finished build step (failed)
[task 2020-04-10T11:10:44.203Z] 11:10:44 INFO - Running post-run listener: _parse_build_tests_ccov
[task 2020-04-10T11:10:44.203Z] 11:10:44 INFO - Running command: ['/builds/worker/checkouts/gecko/obj-x86_64-pc-linux-gnu/_virtualenvs/init/bin/python', 'mach', 'python', 'testing/parse_build_tests_ccov.py'] in /builds/worker/checkouts/gecko
[task 2020-04-10T11:10:44.203Z] 11:10:44 INFO - Copy/paste: /builds/worker/checkouts/gecko/obj-x86_64-pc-linux-gnu/_virtualenvs/init/bin/python mach python testing/parse_build_tests_ccov.py
[task 2020-04-10T11:10:44.205Z] 11:10:44 INFO - Using env: {'ACCEPTED_MAR_CHANNEL_IDS': 'firefox-mozilla-beta,firefox-mozilla-release',
[task 2020-04-10T11:10:44.206Z] 11:10:44 INFO - 'DEBIAN_FRONTEND': 'noninteractive',
[task 2020-04-10T11:10:44.206Z] 11:10:44 INFO - 'DISPLAY': ':2',
[task 2020-04-10T11:10:44.206Z] 11:10:44 INFO - 'EXTRA_MOZHARNESS_CONFIG': '{"update_channel": "beta", "objdir": "obj-build", "mozconfig_variant": "beta"}',
[task 2020-04-10T11:10:44.206Z] 11:10:44 INFO - 'FORCE_GCC': '1',
[task 2020-04-10T11:10:44.206Z] 11:10:44 INFO - 'GECKO_BASE_REPOSITORY': 'https://hg.mozilla.org/mozilla-unified',
[task 2020-04-10T11:10:44.206Z] 11:10:44 INFO - 'GECKO_HEAD_REPOSITORY': 'https://hg.mozilla.org/try',
[task 2020-04-10T11:10:44.206Z] 11:10:44 INFO - 'GECKO_HEAD_REV': 'f9fcaeeef95b361737154290356d650f008c787b',
[task 2020-04-10T11:10:44.206Z] 11:10:44 INFO - 'GECKO_PATH': '/builds/worker/checkouts/gecko',
[task 2020-04-10T11:10:44.206Z] 11:10:44 INFO - 'GRCOV_PATH': '/builds/worker/fetches/grcov',
[task 2020-04-10T11:10:44.206Z] 11:10:44 INFO - 'HG_SHARE_BASE_DIR': '/builds/hg-shared',
[task 2020-04-10T11:10:44.206Z] 11:10:44 INFO - 'HG_STORE_PATH': '/builds/worker/checkouts/hg-store',
[task 2020-04-10T11:10:44.206Z] 11:10:44 INFO - 'HOME': '/builds/worker',
[task 2020-04-10T11:10:44.206Z] 11:10:44 INFO - 'HOSTNAME': 'taskcluster-worker',
[task 2020-04-10T11:10:44.206Z] 11:10:44 INFO - 'LC_ALL': 'C',
[task 2020-04-10T11:10:44.206Z] 11:10:44 INFO - 'LIBRARY_PATH': ':/builds/worker/workspace/obj-build:/builds/worker/workspace/src/gcc/lib64',
[task 2020-04-10T11:10:44.206Z] 11:10:44 INFO - 'LOGNAME': 'worker',
[task 2020-04-10T11:10:44.206Z] 11:10:44 INFO - 'MACH_MAIN_PID': '41',
[task 2020-04-10T11:10:44.206Z] 11:10:44 INFO - 'MAR_CHANNEL_ID': 'firefox-mozilla-beta',
[task 2020-04-10T11:10:44.206Z] 11:10:44 INFO - 'MH_BRANCH': 'try',
[task 2020-04-10T11:10:44.206Z] 11:10:44 INFO - 'MH_BUILD_POOL': 'taskcluster',
[task 2020-04-10T11:10:44.206Z] 11:10:44 INFO - 'MOZBUILD_STATE_PATH': '/builds/worker/.mozbuild',
[task 2020-04-10T11:10:44.206Z] 11:10:44 INFO - 'MOZHARNESS_ACTIONS': 'get-secrets build',
[task 2020-04-10T11:10:44.206Z] 11:10:44 INFO - 'MOZHARNESS_CONFIG': 'builds/releng_base_firefox.py builds/releng_base_linux_64_builds.py',
[task 2020-04-10T11:10:44.206Z] 11:10:44 INFO - 'MOZHARNESS_SCRIPT': 'mozharness/scripts/fx_desktop_build.py',
[task 2020-04-10T11:10:44.206Z] 11:10:44 INFO - 'MOZ_AUTOMATION': '1',
[task 2020-04-10T11:10:44.206Z] 11:10:44 INFO - 'MOZ_BUILD_DATE': '20200410105442',
[task 2020-04-10T11:10:44.206Z] 11:10:44 INFO - 'MOZ_CRASHREPORTER_NO_REPORT': '1',
[task 2020-04-10T11:10:44.206Z] 11:10:44 INFO - 'MOZ_DISABLE_FULL_SYMBOLS': '1',
[task 2020-04-10T11:10:44.206Z] 11:10:44 INFO - 'MOZ_FETCHES': '[{"artifact": "public/build/clang.tar.xz", "extract": true, "task": "OQsiftZGQPybRuokemTusA"}, {"artifact": "public/build/gcc.tar.xz", "extract": true, "task": "A_TVMqVRSBGH18WeDJlZ3Q"}, {"artifact": "public/build/rustc.tar.xz", "extract": true, "task": "R8CF4FR0S3Gfd1sMK3mK0A"}, {"artifact": "public/build/cbindgen.tar.xz", "extract": true, "task": "IL3pXFgfRZuanbaL6qhngA"}, {"artifact": "public/build/sccache.tar.xz", "extract": true, "task": "VHkQiobIQ8mKlUiRIyjNeA"}, {"artifact": "public/build/nasm.tar.bz2", "extract": true, "task": "W_pKPVSXTyK8Ps1D3wbdMg"}, {"artifact": "public/build/node.tar.xz", "extract": true, "task": "RGE0LJ_zQ3mOPIWxnovs1Q"}, {"artifact": "public/build/lucetc.tar.xz", "extract": true, "task": "K9zv9amBTTWhJZsqSYiKXA"}, {"artifact": "public/build/wasi-sysroot.tar.xz", "extract": true, "task": "SqY8yJzXQ4W2ulE3ojJXqQ"}]',
[task 2020-04-10T11:10:44.206Z] 11:10:44 INFO - 'MOZ_FETCHES_DIR': '/builds/worker/fetches',
[task 2020-04-10T11:10:44.206Z] 11:10:44 INFO - 'MOZ_LOW_PARALLELISM_BUILD': '1',
[task 2020-04-10T11:10:44.206Z] 11:10:44 INFO - 'MOZ_OBJDIR': u'/builds/worker/workspace/obj-build',
[task 2020-04-10T11:10:44.206Z] 11:10:44 INFO - 'MOZ_SCM_LEVEL': '1',
[task 2020-04-10T11:10:44.206Z] 11:10:44 INFO - 'MOZ_SIMPLE_PACKAGE_NAME': 'target',
[task 2020-04-10T11:10:44.206Z] 11:10:44 INFO - 'MOZ_SOURCE_CHANGESET': 'f9fcaeeef95b361737154290356d650f008c787b',
[task 2020-04-10T11:10:44.206Z] 11:10:44 INFO - 'MOZ_SOURCE_REPO': 'https://hg.mozilla.org/try',
[task 2020-04-10T11:10:44.206Z] 11:10:44 INFO - 'NEED_XVFB': 'true',
[task 2020-04-10T11:10:44.206Z] 11:10:44 INFO - 'OLDPWD': '/builds/worker',
[task 2020-04-10T11:10:44.206Z] 11:10:44 INFO - 'PATH': '/usr/local/bin:/bin:/usr/bin:/usr/local/sbin:/usr/sbin:/sbin',
[task 2020-04-10T11:10:44.206Z] 11:10:44 INFO - 'PERFHERDER_EXTRA_OPTIONS': 'base-toolchains',
[task 2020-04-10T11:10:44.206Z] 11:10:44 INFO - 'PWD': '/builds/worker',
[task 2020-04-10T11:10:44.206Z] 11:10:44 INFO - 'PYTHONDONTWRITEBYTECODE': '1',
[task 2020-04-10T11:10:44.206Z] 11:10:44 INFO - 'PYTHONUNBUFFERED': '1',
[task 2020-04-10T11:10:44.206Z] 11:10:44 INFO - 'RUN_ID': '0',
[task 2020-04-10T11:10:44.207Z] 11:10:44 INFO - 'SCCACHE_GCS_PROJECT': 'sccache-3',
[task 2020-04-10T11:10:44.207Z] 11:10:44 INFO - 'SCCACHE_IDLE_TIMEOUT': '0',
[task 2020-04-10T11:10:44.207Z] 11:10:44 INFO - 'SHELL': '/bin/bash',
[task 2020-04-10T11:10:44.207Z] 11:10:44 INFO - 'SHLVL': '2',
[task 2020-04-10T11:10:44.207Z] 11:10:44 INFO - 'TASKCLUSTER_INSTANCE_TYPE': 'c5d.4xlarge',
[task 2020-04-10T11:10:44.207Z] 11:10:44 INFO - 'TASKCLUSTER_NAME': '/fervent_lovelace/taskcluster',
[task 2020-04-10T11:10:44.207Z] 11:10:44 INFO - 'TASKCLUSTER_PORT': 'tcp://172.17.0.2:80',
[task 2020-04-10T11:10:44.207Z] 11:10:44 INFO - 'TASKCLUSTER_PORT_80_TCP': 'tcp://172.17.0.2:80',
[task 2020-04-10T11:10:44.207Z] 11:10:44 INFO - 'TASKCLUSTER_PORT_80_TCP_ADDR': '172.17.0.2',
[task 2020-04-10T11:10:44.207Z] 11:10:44 INFO - 'TASKCLUSTER_PORT_80_TCP_PORT': '80',
[task 2020-04-10T11:10:44.207Z] 11:10:44 INFO - 'TASKCLUSTER_PORT_80_TCP_PROTO': 'tcp',
[task 2020-04-10T11:10:44.207Z] 11:10:44 INFO - 'TASKCLUSTER_PROXY_URL': 'http://taskcluster',
[task 2020-04-10T11:10:44.207Z] 11:10:44 INFO - 'TASKCLUSTER_PUBLIC_IP': '34.204.176.19',
[task 2020-04-10T11:10:44.207Z] 11:10:44 INFO - 'TASKCLUSTER_ROOT_URL': 'https://firefox-ci-tc.services.mozilla.com',
[task 2020-04-10T11:10:44.207Z] 11:10:44 INFO - 'TASKCLUSTER_WORKER_GROUP': 'aws',
[task 2020-04-10T11:10:44.207Z] 11:10:44 INFO - 'TASKCLUSTER_WORKER_LOCATION': '{"availabilityZone":"us-east-1f","cloud":"aws","region":"us-east-1"}',
[task 2020-04-10T11:10:44.207Z] 11:10:44 INFO - 'TASKCLUSTER_WORKER_TYPE': 'b-linux',
[task 2020-04-10T11:10:44.207Z] 11:10:44 INFO - 'TASK_ID': 'N-zvWzaESAelYuaDKebrVg',
[task 2020-04-10T11:10:44.207Z] 11:10:44 INFO - 'TERM': 'xterm',
[task 2020-04-10T11:10:44.207Z] 11:10:44 INFO - 'TINDERBOX_OUTPUT': '1',
[task 2020-04-10T11:10:44.207Z] 11:10:44 INFO - 'TOOLTOOL_CACHE': '/builds/worker/tooltool-cache',
[task 2020-04-10T11:10:44.207Z] 11:10:44 INFO - 'TOOLTOOL_HOME': '/builds',
[task 2020-04-10T11:10:44.207Z] 11:10:44 INFO - 'TRY_COMMIT_MSG': '',
[task 2020-04-10T11:10:44.207Z] 11:10:44 INFO - 'UPLOAD_DIR': '/builds/worker/artifacts',
[task 2020-04-10T11:10:44.207Z] 11:10:44 INFO - 'USER': 'worker',
[task 2020-04-10T11:10:44.207Z] 11:10:44 INFO - 'USE_SCCACHE': '1',
[task 2020-04-10T11:10:44.207Z] 11:10:44 INFO - 'VIRTUAL_ENV': '/builds/worker/checkouts/gecko/obj-x86_64-pc-linux-gnu/_virtualenvs/init',
[task 2020-04-10T11:10:44.207Z] 11:10:44 INFO - 'WORKSPACE': '/builds/worker/workspace',

Flags: needinfo?(jbonisteel)
Flags: needinfo?(jbonisteel) → needinfo?(dmalyshau)

Fix is coming

Assignee: nobody → dmalyshau
Flags: needinfo?(dmalyshau)
Pushed by kgupta@mozilla.com:
https://hg.mozilla.org/integration/autoland/rev/edabb76cfecf
Fix literal string cast in WebGPU nightly check r=kats

For today's Central as beta simulations, we have this new failure which might be related to this bug (1629024).
https://treeherder.mozilla.org/#/jobs?repo=try&resultStatus=testfailed%2Cbusted%2Cexception&revision=f045cd13816683dadbc168d51823e14798cdd847&selectedJob=297225826

[task 2020-04-11T11:12:03.118Z] 11:12:03 INFO - TEST-START | dom/webgpu/mochitest/test_buffer_mapping.html
[task 2020-04-11T11:12:04.568Z] 11:12:04 INFO - GECKO(8324) | Assertion failure: value, at /builds/worker/workspace/obj-build/dist/include/mozilla/dom/BindingUtils.h:1045

:kvark, can you please take a look?

Flags: needinfo?(dmalyshau)

Hmm, the tests are not able to enable the pref because now it's force disabled. That makes sense, we need to adjust the tests to only run on Release. Will fix that ASAP. Having the failure is not affecting build stability in any way.

Flags: needinfo?(dmalyshau)
Keywords: leave-open
Priority: -- → P1

follow-up to D70435

Flags: needinfo?(dmalyshau)

There's two bugs here; the first is a compile error and the second is the webgpu test job bustage. The first has been fixed by the patch that landed; the second has a patch awaiting review.

Flags: needinfo?(dmalyshau)
Pushed by dmalyshau@mozilla.com:
https://hg.mozilla.org/integration/autoland/rev/c384446d306e
Run WebGPU tests on nightly only r=jgilbert
Status: NEW → RESOLVED
Closed: 4 months ago
Keywords: leave-open
Resolution: --- → FIXED

Comment on attachment 9139845 [details]
Fix literal string cast in WebGPU nightly check

Beta/Release Uplift Approval Request

  • User impact if declined: Unable to build
  • Is this code covered by automated tests?: Yes
  • Has the fix been verified in Nightly?: Yes
  • Needs manual test from QE?: No
  • If yes, steps to reproduce:
  • List of other uplifts needed: None
  • Risk to taking this patch: Low
  • Why is the change risky/not risky? (and alternatives if risky): Very minor fixes here
  • String changes made/needed:
Attachment #9139845 - Flags: approval-mozilla-beta?
Attachment #9139960 - Flags: approval-mozilla-beta?

I don't think you need these patches uplifted. The failure was on beta simulation try pushes with the current nightly code.

But the currently nightly code has been requested for uplift as well, so it will start permafailing on beta, if I understand correctly.

Comment on attachment 9139845 [details]
Fix literal string cast in WebGPU nightly check

Needed to avoid permafails when bug 1616741 is uplifted. Approved for 76.0b5.

Attachment #9139845 - Flags: approval-mozilla-beta? → approval-mozilla-beta+
Attachment #9139960 - Flags: approval-mozilla-beta? → approval-mozilla-beta+
Target Milestone: --- → mozilla77

(In reply to Dzmitry Malyshau [:kvark] from comment #14)

But the currently nightly code has been requested for uplift as well, so it will start permafailing on beta, if I understand correctly.

Ah yep, my bad! Didn't realize the other patch was getting uplifted.

You need to log in before you can comment on or make changes to this bug.