Sunbird Mac OS X nightly builds are failing since 19-Nov-2008

VERIFIED FIXED in 1.0b1

Status

defect
--
major
VERIFIED FIXED
11 years ago
8 years ago

People

(Reporter: ssitter, Assigned: ause)

Tracking

Trunk
1.0b1
All
macOS

Details

Attachments

(1 attachment)

Sunbird Mac OS X nightly builds are failing since 19-Nov-2008

Latest available build is from 18-Nov-2008
http://ftp.mozilla.org/pub/mozilla.org/calendar/sunbird/nightly/latest-trunk/
From 2008-11-21 build log
<http://tinderbox.mozilla.org/showlog.cgi?log=Sunbird/1227267136.1227269457.25355.gz#err0>

[[[
gcc-4.0 -arch ppc -o HTTPMultipartUpload.o -c -I../../../../../../dist/include/system_wrappers -include /builds/buildbot/comm-central-sunbird-macosx-nightly/build/mozilla/config/gcc_hidden.h -DMOZ_SUNBIRD=1 -DOSTYPE=\"Darwin8.7.0\" -DOSARCH=Darwin -I/builds/buildbot/comm-central-sunbird-macosx-nightly/build/mozilla/toolkit/crashreporter/google-breakpad/src/common/mac/../.. -I/builds/buildbot/comm-central-sunbird-macosx-nightly/build/mozilla/toolkit/crashreporter/google-breakpad/src/common/mac -I.  -I../../../../../../dist/include   -I../../../../../../dist/include/breakpad_mac_common -I/builds/buildbot/comm-central-sunbird-macosx-nightly/build/objdir-tb/ppc/mozilla/dist/include/nspr     -I/builds/buildbot/comm-central-sunbird-macosx-nightly/build/objdir-tb/ppc/mozilla/dist/sdk/include    -mdynamic-no-pic  -Wall -W -Wno-unused -Wpointer-arith -Wcast-align -W -Wno-long-long -gstabs -gfull -save-temps -isysroot /Developer/SDKs/MacOSX10.4u.sdk -fno-strict-aliasing -fpascal-strings -fno-common -I/Developer/SDKs/MacOSX10.4u.sdk/Developer/Headers/FlatCarbon  -DNDEBUG -DTRIMMED -O2   -include ../../../../../../mozilla-config.h -DMOZILLA_CLIENT -Wp,-MD,.deps/HTTPMultipartUpload.pp -fobjc-exceptions /builds/buildbot/comm-central-sunbird-macosx-nightly/build/mozilla/toolkit/crashreporter/google-breakpad/src/common/mac/HTTPMultipartUpload.m

string_utilities.s:1213:I need a comma after symbol's name
string_utilities.s:1213:Invalid mnemonic 'mitsIeE12min_exponentE'
NEXT ERROR make[9]: *** [host_string_utilities.o] Error 1
make[9]: *** Waiting for unfinished jobs....
string_utilities.s:2194:Invalid mnemonic 'indirect_symbol'
string_utilities.s:2198:FATAL:Symbol L__ZdaPv$stub already defined.
make[9]: *** [string_utilities.o] Error 1
make[8]: *** [libs] Error 2
make[7]: *** [libs] Error 2
make[6]: *** [libs_tier_toolkit] Error 2
make[5]: *** [tier_toolkit] Error 2
make[4]: *** [default] Error 2
make[3]: *** [default] Error 2
make[2]: *** [build] Error 2
make[1]: *** [build] Error 2
]]]

From 2008-11-20 build log
<http://tinderbox.mozilla.org/showlog.cgi?log=Sunbird/1227186039.1227188390.28469.gz#err0>

[[[
g++-4.0 -arch ppc -o macho_walker.o -c -I../../../../../../dist/include/system_wrappers -include /builds/buildbot/comm-central-sunbird-macosx-nightly/build/mozilla/config/gcc_hidden.h -DMOZ_SUNBIRD=1 -DOSTYPE=\"Darwin8.7.0\" -DOSARCH=Darwin -I/builds/buildbot/comm-central-sunbird-macosx-nightly/build/mozilla/toolkit/crashreporter/google-breakpad/src/common/mac/../.. -I/builds/buildbot/comm-central-sunbird-macosx-nightly/build/mozilla/toolkit/crashreporter/google-breakpad/src/common/mac -I.  -I../../../../../../dist/include   -I../../../../../../dist/include/breakpad_mac_common -I/builds/buildbot/comm-central-sunbird-macosx-nightly/build/objdir-tb/ppc/mozilla/dist/include/nspr     -I/builds/buildbot/comm-central-sunbird-macosx-nightly/build/objdir-tb/ppc/mozilla/dist/sdk/include    -mdynamic-no-pic   -fno-rtti -fno-exceptions -Wall -Wpointer-arith -Woverloaded-virtual -Wsynth -Wno-ctor-dtor-privacy -Wno-non-virtual-dtor -Wcast-align -Wno-invalid-offsetof -Wno-long-long -gstabs -gfull -save-temps -isysroot /Developer/SDKs/MacOSX10.4u.sdk -fno-strict-aliasing -fpascal-strings -fno-common -fshort-wchar -I/Developer/SDKs/MacOSX10.4u.sdk/Developer/Headers/FlatCarbon  -DNDEBUG -DTRIMMED -O2   -DMOZILLA_CLIENT -include ../../../../../../mozilla-config.h -Wp,-MD,.deps/macho_walker.pp /builds/buildbot/comm-central-sunbird-macosx-nightly/build/mozilla/toolkit/crashreporter/google-breakpad/src/common/mac/macho_walker.cc

macho_id.s:401:End of file in string: inserted '"'
macho_id.s:402:I need a comma after symbol's name
macho_id.s:402:Rest of line ignored. 1st junk character valued 76 (L).
macho_id.s:502:Complex expression. Absolute segment assumed.
macho_id.s:508:Complex expression. Absolute segment assumed.
macho_id.s:512:Complex expression. Absolute segment assumed.
macho_id.s:515:Complex expression. Absolute segment assumed.
macho_id.s:530:Complex expression. Absolute segment assumed.
macho_id.s:1445:Complex expression. Absolute segment assumed.
macho_id.s:1948:Invalid mnemonic ''
NEXT ERROR make[9]: *** [host_macho_id.o] Error 1
make[9]: *** Waiting for unfinished jobs....
macho_id.s:2390:FATAL:Symbol LBB32 already defined.
make[9]: *** [macho_id.o] Error 1
make[8]: *** [libs] Error 2
make[7]: *** [libs] Error 2
make[6]: *** [libs_tier_toolkit] Error 2
make[5]: *** [tier_toolkit] Error 2
make[4]: *** [default] Error 2
make[3]: *** [default] Error 2
make[2]: *** [build] Error 2
make[1]: *** [build] Error 2
]]]

From 2008-11-19 build log
<http://tinderbox.mozilla.org/showlog.cgi?log=Sunbird/1227093801.1227096059.4207.gz#err0>

[[[
g++-4.0 -arch ppc -o macho_walker.o -c -I../../../../../../dist/include/system_wrappers -include /builds/buildbot/comm-central-sunbird-macosx-nightly/build/mozilla/config/gcc_hidden.h -DMOZ_SUNBIRD=1 -DOSTYPE=\"Darwin8.7.0\" -DOSARCH=Darwin -I/builds/buildbot/comm-central-sunbird-macosx-nightly/build/mozilla/toolkit/crashreporter/google-breakpad/src/common/mac/../.. -I/builds/buildbot/comm-central-sunbird-macosx-nightly/build/mozilla/toolkit/crashreporter/google-breakpad/src/common/mac -I.  -I../../../../../../dist/include   -I../../../../../../dist/include/breakpad_mac_common -I/builds/buildbot/comm-central-sunbird-macosx-nightly/build/objdir-tb/ppc/mozilla/dist/include/nspr     -I/builds/buildbot/comm-central-sunbird-macosx-nightly/build/objdir-tb/ppc/mozilla/dist/sdk/include    -mdynamic-no-pic   -fno-rtti -fno-exceptions -Wall -Wpointer-arith -Woverloaded-virtual -Wsynth -Wno-ctor-dtor-privacy -Wno-non-virtual-dtor -Wcast-align -Wno-invalid-offsetof -Wno-long-long -gstabs -gfull -save-temps -isysroot /Developer/SDKs/MacOSX10.4u.sdk -fno-strict-aliasing -fpascal-strings -fno-common -fshort-wchar -I/Developer/SDKs/MacOSX10.4u.sdk/Developer/Headers/FlatCarbon  -DNDEBUG -DTRIMMED -O2   -DMOZILLA_CLIENT -include ../../../../../../mozilla-config.h -Wp,-MD,.deps/macho_walker.pp /builds/buildbot/comm-central-sunbird-macosx-nightly/build/mozilla/toolkit/crashreporter/google-breakpad/src/common/mac/macho_walker.cc

macho_id.s:0:End-of-File not at end of a line
macho_id.s:361:End-of-File not at end of a line
macho_id.s:unknown:Partial line at end of file ignored
make[9]: *** [host_macho_id.o] Error 1
make[9]: *** Waiting for unfinished jobs....
make[8]: *** [libs] Error 2
make[7]: *** [libs] Error 2
make[6]: *** [libs_tier_toolkit] Error 2
make[5]: *** [tier_toolkit] Error 2
make[4]: *** [default] Error 2
make[3]: *** [default] Error 2
make[2]: *** [build] Error 2
make[1]: *** [build] Error 2
]]]
Could it be related to the mozconfig changes from Bug 463790? But why should only the nightly builds fail but the hourly not? But why should Sunbird fail but not Firefox, Thunderbird and SeaMonkey?
I doubt it has anything to do with the mozconfig changes, as both the regular dep builds and the nightlies run with the exact same mozconfig on the same machine.

My guess at this point is that the fact that the dep builder succeeds might be because it's a dep build. Could be something broken that doesn't manifest itself because the objects have been kept around in the dep build.

I'd suggest first trying to clobber the osx dep builder and see if it breaks too.
it's a mac specific race condition (host and regular compile)
see Bug 417045 and latest attachment there...
So a solution could be to temporary disable "-j6" in the mozconfig until Bug 417045 is fixed?
yes, disabling -j6 should fix the breakage until either the patch is applied or "-save-temps" is gone (Bug 421534).
Attachment #349737 - Flags: review?(ssitter)
Comment on attachment 349737 [details] [diff] [review]
[checked in] giving up -j on nightlies for now

r=ssitter, but I'd prefer a comment like "disable -j6 until bug 417045 and bug 421534 are fixed"
Attachment #349737 - Flags: review?(ssitter) → review+
Attachment #349737 - Attachment description: giving up -j on nightlies for now → [checked in] giving up -j on nightlies for now
Status: NEW → RESOLVED
Closed: 11 years ago
Resolution: --- → FIXED
Assignee: nobody → ause
Component: General → Build Config
QA Contact: general → build
Status: RESOLVED → VERIFIED
Target Milestone: --- → 1.0
These bugs are likely targeted at Lightning 1.0b1, not Lightning 1.0. If this change was done in error, please adjust the target milestone to its correct value. To filter on this bugspam, you can use "lightning-10-target-move".
Target Milestone: 1.0 → 1.0b1
You need to log in before you can comment on or make changes to this bug.