ogg-video related test failures

VERIFIED WORKSFORME

Status

()

VERIFIED WORKSFORME
10 years ago
8 years ago

People

(Reporter: jimm, Unassigned)

Tracking

1.9.1 Branch
x86
All
Points:
---

Firefox Tracking Flags

(Not tracked)

Details

(Reporter)

Description

10 years ago
REFTEST TEST-UNEXPECTED-FAIL | file:///e:/builds/moz2_slave/mozilla-1.9.1-win32-unittest/build/layout/reftests/ogg-video/aspect-ratio-2b.xhtml |
REFTEST TEST-UNEXPECTED-FAIL | file:///e:/builds/moz2_slave/mozilla-1.9.1-win32-unittest/build/layout/reftests/ogg-video/aspect-ratio-2b.xhtml |
make: *** [reftest] Error 1
Unknown Error: command finished with exit code: 2

http://tinderbox.mozilla.org/showlog.cgi?log=Firefox3.5/1242847243.1242853050.30692.gz

REFTEST TEST-UNEXPECTED-FAIL | file:///e:/builds/moz2_slave/mozilla-1.9.1-win32-unittest/build/layout/reftests/ogg-video/aspect-ratio-2b.xhtml |
REFTEST TEST-UNEXPECTED-FAIL | file:///e:/builds/moz2_slave/mozilla-1.9.1-win32-unittest/build/layout/reftests/ogg-video/aspect-ratio-2b.xhtml |
make: *** [reftest] Error 1
Unknown Error: command finished with exit code: 2

http://tinderbox.mozilla.org/showlog.cgi?log=Firefox3.5/1242847243.1242853050.30692.gz
(Reporter)

Comment 1

10 years ago
REFTEST TEST-UNEXPECTED-FAIL | http://localhost:4444/89/ogg-video/object-aspect-ratio-2b.xhtml | timed out waiting for onload to fire
REFTEST TEST-UNEXPECTED-FAIL | file:///builds/slave/mozilla-1.9.1-macosx-unittest/build/layout/reftests/ogg-video/zoomed-1.xhtml |
REFTEST TEST-UNEXPECTED-FAIL | http://localhost:4444/89/ogg-video/object-aspect-ratio-2b.xhtml | timed out waiting for onload to fire
REFTEST TEST-UNEXPECTED-FAIL | file:///builds/slave/mozilla-1.9.1-macosx-unittest/build/layout/reftests/ogg-video/zoomed-1.xhtml |
make: *** [reftest] Error 1
Unknown Error: command finished with exit code: 2

http://tinderbox.mozilla.org/showlog.cgi?log=Firefox3.5/1242911723.1242920555.23514.gz
This failing on 10.6 unittest runs (both debug and opt) which are running in production but hidden on the tinderbox page.

REFTEST INFO | Loading http://localhost:4444/1272011170766/120/ogg-video/zoomed-1-ref.html
++DOMWINDOW == 50 (0x113494438) [serial = 7983] [outer = 0x115c71180]
REFTEST TEST-UNEXPECTED-FAIL | file:///Users/cltbld/talos-slave/mozilla-central-snowleopard-debug-u-reftest/build/reftest/tests/layout/reftests/ogg-video/zoomed-1.xhtml |
***(image data removed for brevity)***
REFTEST number of differing pixels: 31500
No longer blocks: 558777
This hasn't failed in months, resolving WFM.
Status: NEW → RESOLVED
Last Resolved: 8 years ago
Resolution: --- → WORKSFORME
Status: RESOLVED → VERIFIED
You need to log in before you can comment on or make changes to this bug.