Closed Bug 529150 Opened 15 years ago Closed 14 years ago

Intermittent failure of test_bug371473.js: test failed (with xpcshell return code: 1)

Categories

(Core :: Networking, defect)

x86
Windows Server 2003
defect
Not set
normal

Tracking

()

RESOLVED DUPLICATE of bug 535585

People

(Reporter: ehsan.akhgari, Unassigned)

References

()

Details

http://tinderbox.mozilla.org/showlog.cgi?tree=Firefox-Unittest&errorparser=unittest&logfile=1258408857.1258416693.809.gz&buildtime=1258408857&buildname=WINNT%205.2%20mozilla-central%20debug%20test%20everythingelse&fulltext=1
WINNT 5.2 mozilla-central debug test everythingelse on 2009/11/16 14:00:57

TEST-UNEXPECTED-FAIL | e:\builds\moz2_slave\mozilla-central-win32-debug-unittest-everythingelse\build\xpcshell\tests\test_necko\unit\test_bug371473.js | test failed (with xpcshell return code: 1), see following log:
  >>>>>>>
  ### XPCOM_MEM_LEAK_LOG defined -- logging leaks to c:\docume~1\cltbld\locals~1\temp\tmpwrksd1\runxpcshelltests_leaks.log
*** Registering components in: xpconnect
*** Registering components in: nsUCvMathModule
*** Registering components in: nsUConvModule
*** Registering components in: nsI18nModule
*** Registering components in: nsChardetModule
*** Registering components in: nsUniversalCharDetModule
*** Registering components in: necko
*** Registering components in: nsCookieModule
*** Registering components in: nsPermissionsModule
*** Registering components in: nsAuthModule
*** Registering components in: nsJarModule
*** Registering components in: ZipWriterModule
*** Registering components in: nsPrefModule
*** Registering components in: nsSecurityManagerModule
*** Registering components in: nsRDFModule
*** Registering components in: nsXPIntlModule
*** Registering components in: nsWindowDataSourceModule
*** Registering components in: nsParserModule
*** Registering components in: nsGfxModule
*** Registering components in: nsWidgetModule
*** Registering components in: nsImageLib2Module
*** Registering components in: nsIconDecoderModule
*** Registering components in: nsPluginModule
*** Registering components in: nsLayoutModule
*** Registering components in: docshell_provider
*** Registering components in: embedcomponents
*** Registering components in: Browser_Embedding_Module
*** Registering components in: nsAccessibilityModule
*** Registering components in: appshell
*** Registering components in: nsTransactionManagerModule
*** Registering components in: nsComposerModule
*** Registering components in: nsChromeModule
*** Registering components in: application
*** Registering components in: nsFindComponent
*** Registering components in: Apprunner
*** Registering components in: CommandLineModule
*** Registering components in: mozStorageModule
*** Registering components in: nsPlacesModule
*** Registering components in: tkAutoCompleteModule
*** Registering components in: satchel
*** Registering components in: PKI
*** Registering components in: nsToolkitCompsModule
*** Registering components in: nsSoftwareUpdate
*** Registering components in: JavaScript_Debugger
*** Registering components in: BOOT
*** Registering components in: NSS
*** Registering components in: nsAutoConfigModule
*** Registering components in: mozSpellCheckerModule
*** Registering components in: nsWindowsProxyModule
*** Registering components in: jsctypes
************************************************************
* Call to xpconnect wrapped JSObject produced this error:  *
[Exception... "Component returned failure code: 0x80570016 (NS_ERROR_XPC_GS_RETURNED_FAILURE) [nsIJSCID.getService]"  nsresult: "0x80570016 (NS_ERROR_XPC_GS_RETURNED_FAILURE)"  location: "JS frame :: file:///e:/builds/moz2_slave/mozilla-central-win32-debug-unittest-everythingelse/build/firefox/components/nsBrowserContentHandler.js :: mod_regself :: line 830"  data: no]
************************************************************
TEST-INFO | (xpcshell/head.js) | test 1 pending
nsNativeModuleLoader::LoadModule("e:\builds\moz2_slave\mozilla-central-win32-debug-unittest-everythingelse\build\firefox\components\testdynamic.dll") - load FAILED, rv: 80520012, error:
	<unknown; can't get error from NSPR>
nsNativeModuleLoader::LoadModule("e:\builds\moz2_slave\mozilla-central-win32-debug-unittest-everythingelse\build\firefox\components\MyService.dll") - load FAILED, rv: 80520012, error:
	<unknown; can't get error from NSPR>
nsNativeModuleLoader::LoadModule("e:\builds\moz2_slave\mozilla-central-win32-debug-unittest-everythingelse\build\firefox\components\xpcomsample.dll") - load FAILED, rv: 80520012, error:
	<unknown; can't get error from NSPR>
TEST-INFO | (xpcshell/head.js) | test 1 finished
TEST-INFO | (xpcshell/head.js) | exiting test
TEST-INFO | (xpcshell/head.js) | No (+ 0) checks actually run
WARNING: nsExceptionService ignoring thread destruction after shutdown: file e:/builds/moz2_slave/mozilla-central-win32-debug/build/xpcom/base/nsExceptionService.cpp, line 194
nsStringStats
 => mAllocCount:           1857
 => mReallocCount:            8
 => mFreeCount:            1857
 => mShareCount:            874
 => mAdoptCount:            309
 => mAdoptFreeCount:        309
nsXPConnect::CommenceShutdown()

  <<<<<<<
Whiteboard: [orange]
Blocks: 535585
No longer blocks: 438871, 535585
Status: NEW → RESOLVED
Closed: 14 years ago
Resolution: --- → DUPLICATE
Whiteboard: [orange]
You need to log in before you can comment on or make changes to this bug.