Last Comment Bug 741474 - Intermittent TEST-UNEXPECTED-FAIL | chrome://mochitests/content/a11y/accessible/tree/test_img.html | Different amount of expected children of ['img@id="imgmap" node', address: [object HTMLImageElement], role: image map, ...
: Intermittent TEST-UNEXPECTED-FAIL | chrome://mochitests/content/a11y/accessib...
Status: RESOLVED FIXED
[good first bug][mentor=marco.zehe@go...
: intermittent-failure
Product: Core
Classification: Components
Component: Disability Access APIs (show other bugs)
: 14 Branch
: x86 Linux
: -- normal (vote)
: mozilla15
Assigned To: Nagarjuna Varma [:Infinity]
:
Mentors:
Depends on:
Blocks: a11yrandomorange 438871
  Show dependency treegraph
 
Reported: 2012-04-02 11:12 PDT by Matt Brubeck (:mbrubeck)
Modified: 2012-11-25 19:31 PST (History)
3 users (show)
ryanvm: in‑testsuite+
See Also:
Crash Signature:
(edit)
QA Whiteboard:
Iteration: ---
Points: ---
Has Regression Range: ---
Has STR: ---


Attachments
Patchv1 (531 bytes, patch)
2012-05-15 13:05 PDT, Nagarjuna Varma [:Infinity]
surkov.alexander: review+
Details | Diff | Review

Description Matt Brubeck (:mbrubeck) 2012-04-02 11:12:03 PDT
https://tbpl.mozilla.org/php/getParsedLog.php?id=10555580&tree=Firefox
Rev3 Fedora 12 mozilla-central opt test mochitest-other on 2012-04-01 16:12:47 PDT for push ba43d5d6a6c3

20653 INFO TEST-START | chrome://mochitests/content/a11y/accessible/tree/test_img.html
20654 INFO TEST-INFO | chrome://mochitests/content/a11y/accessible/tree/test_img.html | must wait for load
20655 INFO TEST-PASS | chrome://mochitests/content/a11y/accessible/tree/test_img.html | Wrong value of property 'role' for ['img@id="imgmap" node', address: [object HTMLImageElement], role: image map, address: [xpconnect wrapped nsIAccessible]]. - image map should equal image map
20656 ERROR TEST-UNEXPECTED-FAIL | chrome://mochitests/content/a11y/accessible/tree/test_img.html | Different amount of expected children of ['img@id="imgmap" node', address: [object HTMLImageElement], role: image map, address: [xpconnect wrapped nsIAccessible]]. - got 0, expected 2
20657 INFO TEST-PASS | chrome://mochitests/content/a11y/accessible/tree/test_img.html | Wrong value of property 'role' for ['img@id="img" node', address: [object HTMLImageElement], role: graphic, address: [xpconnect wrapped nsIAccessible]]. - graphic should equal graphic
20658 INFO TEST-PASS | chrome://mochitests/content/a11y/accessible/tree/test_img.html | Different amount of expected children of ['img@id="img" node', address: [object HTMLImageElement], role: graphic, address: [xpconnect wrapped nsIAccessible]]. - 0 should equal 0
20659 INFO TEST-PASS | chrome://mochitests/content/a11y/accessible/tree/test_img.html | Wrong first child of ['img@id="img" node', address: [object HTMLImageElement], role: graphic, address: [xpconnect wrapped nsIAccessible]] - null should equal null
20660 INFO TEST-PASS | chrome://mochitests/content/a11y/accessible/tree/test_img.html | Wrong last child of ['img@id="img" node', address: [object HTMLImageElement], role: graphic, address: [xpconnect wrapped nsIAccessible]] - null should equal null
20661 INFO TEST-END | chrome://mochitests/content/a11y/accessible/tree/test_img.html | finished in 55ms
Comment 1 Treeherder Robot 2012-04-05 16:04:42 PDT
philor
https://tbpl.mozilla.org/php/getParsedLog.php?id=10678926&tree=Mozilla-Inbound
Rev3 Fedora 12x64 mozilla-inbound opt test mochitest-other on 2012-04-05 15:27:36

20666 ERROR TEST-UNEXPECTED-FAIL | chrome://mochitests/content/a11y/accessible/tree/test_img.html | Different amount of expected children of ['img@id="imgmap" node', address: [object HTMLImageElement], role: image map, address: [xpconnect wrapped nsIAccessible]]. - got 0, expected 2
Comment 2 Treeherder Robot 2012-04-08 14:38:23 PDT
philor
https://tbpl.mozilla.org/php/getParsedLog.php?id=10736540&tree=Fx-Team
Rev3 Fedora 12 fx-team pgo test mochitest-other on 2012-04-08 06:54:51

TEST-UNEXPECTED-FAIL | chrome://mochitests/content/browser/toolkit/components/startup/tests/browser/browser_bug537449.js | an unexpected uncaught JS exception reported through window.onerror - NS_ERROR_FAILURE: Component returned failure code: 0x80004005 (NS_ERROR_FAILURE) [nsITypeAheadFind.setDocShell] at chrome://browser/content/tabbrowser.xml:919
TEST-UNEXPECTED-FAIL | chrome://mochitests/content/browser/toolkit/components/startup/tests/browser/browser_bug537449.js | an unexpected uncaught JS exception reported through window.onerror - NS_ERROR_FAILURE: Component returned failure code: 0x80004005 (NS_ERROR_FAILURE) [nsITypeAheadFind.setDocShell] at chrome://global/content/bindings/browser.xml:599
20654 ERROR TEST-UNEXPECTED-FAIL | chrome://mochitests/content/a11y/accessible/tree/test_img.html | Different amount of expected children of ['img@id="imgmap" node', address: [object HTMLImageElement], role: image map, address: [xpconnect wrapped nsIAccessible]]. - got 0, expected 2
Comment 3 Treeherder Robot 2012-04-10 12:43:58 PDT
philor
https://tbpl.mozilla.org/php/getParsedLog.php?id=10780522&tree=Mozilla-Inbound
Rev3 WINNT 5.1 mozilla-inbound pgo test mochitest-other on 2012-04-10 10:48:59

20718 ERROR TEST-UNEXPECTED-FAIL | chrome://mochitests/content/a11y/accessible/tree/test_img.html | Different amount of expected children of ['img@id="imgmap" node', address: [object HTMLImageElement], role: image map, address: [xpconnect wrapped nsIAccessible]]. - got 0, expected 2
Comment 4 Treeherder Robot 2012-04-10 12:49:16 PDT
philor
https://tbpl.mozilla.org/php/getParsedLog.php?id=10782801&tree=Mozilla-Inbound
Rev3 Fedora 12x64 mozilla-inbound opt test mochitest-other on 2012-04-10 12:12:19

20667 ERROR TEST-UNEXPECTED-FAIL | chrome://mochitests/content/a11y/accessible/tree/test_img.html | Different amount of expected children of ['img@id="imgmap" node', address: [object HTMLImageElement], role: image map, address: [xpconnect wrapped nsIAccessible]]. - got 0, expected 2
Comment 5 Treeherder Robot 2012-04-11 19:24:44 PDT
philor
https://tbpl.mozilla.org/php/getParsedLog.php?id=10828863&tree=Mozilla-Inbound
Rev3 WINNT 5.1 mozilla-inbound opt test mochitest-other on 2012-04-11 17:59:21

20729 ERROR TEST-UNEXPECTED-FAIL | chrome://mochitests/content/a11y/accessible/tree/test_img.html | Different amount of expected children of ['img@id="imgmap" node', address: [object HTMLImageElement], role: image map, address: [xpconnect wrapped nsIAccessible]]. - got 0, expected 2
Comment 6 Treeherder Robot 2012-04-15 03:08:17 PDT
Ms2ger%gmail.com
https://tbpl.mozilla.org/php/getParsedLog.php?id=10916064&tree=Mozilla-Inbound
Rev3 Fedora 12 mozilla-inbound pgo test mochitest-other on 2012-04-15 00:55:55

20682 ERROR TEST-UNEXPECTED-FAIL | chrome://mochitests/content/a11y/accessible/tree/test_img.html | Different amount of expected children of ['img@id="imgmap" node', address: [object HTMLImageElement], role: image map, address: [xpconnect wrapped nsIAccessible]]. - got 0, expected 2
Comment 7 alexander :surkov 2012-04-15 23:44:31 PDT
just call ensureImageMapTree before image map tree test
Comment 8 Treeherder Robot 2012-04-17 11:49:40 PDT
jwein%mozilla.com
https://tbpl.mozilla.org/php/getParsedLog.php?id=10964772&tree=Try
Rev3 WINNT 6.1 try opt test mochitest-other on 2012-04-16 23:05:10
slave: talos-r3-w7-013

20731 ERROR TEST-UNEXPECTED-FAIL | chrome://mochitests/content/a11y/accessible/tree/test_img.html | Different amount of expected children of ['img@id="imgmap" node', address: [object HTMLImageElement], role: image map, address: [xpconnect wrapped nsIAccessible]]. - got 0, expected 2
Comment 9 Treeherder Robot 2012-04-17 14:50:35 PDT
philor
https://tbpl.mozilla.org/php/getParsedLog.php?id=10985395&tree=Mozilla-Inbound
Rev3 Fedora 12 mozilla-inbound pgo test mochitest-other on 2012-04-17 13:17:10
slave: talos-r3-fed-035

20681 ERROR TEST-UNEXPECTED-FAIL | chrome://mochitests/content/a11y/accessible/tree/test_img.html | Different amount of expected children of ['img@id="imgmap" node', address: [object HTMLImageElement], role: image map, address: [xpconnect wrapped nsIAccessible]]. - got 0, expected 2
Comment 10 Treeherder Robot 2012-04-19 17:50:03 PDT
philor
https://tbpl.mozilla.org/php/getParsedLog.php?id=11043639&tree=Profiling
Rev3 WINNT 6.1 profiling opt test mochitest-other on 2012-04-19 10:26:15
slave: talos-r3-w7-051

20738 ERROR TEST-UNEXPECTED-FAIL | chrome://mochitests/content/a11y/accessible/tree/test_img.html | Different amount of expected children of ['img@id="imgmap" node', address: [object HTMLImageElement], role: image map, address: [xpconnect wrapped nsIAccessible]]. - got 0, expected 2
Comment 11 Treeherder Robot 2012-04-21 19:44:42 PDT
philor
https://tbpl.mozilla.org/php/getParsedLog.php?id=11099674&tree=Birch
Rev3 WINNT 6.1 birch pgo test mochitest-other on 2012-04-21 18:33:36
slave: talos-r3-w7-027

20736 ERROR TEST-UNEXPECTED-FAIL | chrome://mochitests/content/a11y/accessible/tree/test_img.html | Different amount of expected children of ['img@id="imgmap" node', address: [object HTMLImageElement], role: image map, address: [xpconnect wrapped nsIAccessible]]. - got 0, expected 2
Comment 12 Treeherder Robot 2012-04-22 04:50:35 PDT
:emk
https://tbpl.mozilla.org/php/getParsedLog.php?id=11105242&tree=Try
Rev3 WINNT 6.1 try opt test mochitest-other on 2012-04-22 03:53:29
slave: talos-r3-w7-023

20737 ERROR TEST-UNEXPECTED-FAIL | chrome://mochitests/content/a11y/accessible/tree/test_img.html | Different amount of expected children of ['img@id="imgmap" node', address: [object HTMLImageElement], role: image map, address: [xpconnect wrapped nsIAccessible]]. - got 0, expected 2
Comment 13 Treeherder Robot 2012-04-24 22:46:10 PDT
philor
https://tbpl.mozilla.org/php/getParsedLog.php?id=11182530&tree=Mozilla-Inbound
Rev3 Fedora 12x64 mozilla-inbound opt test mochitest-other on 2012-04-24 21:01:05
slave: talos-r3-fed64-038

20688 ERROR TEST-UNEXPECTED-FAIL | chrome://mochitests/content/a11y/accessible/tree/test_img.html | Different amount of expected children of ['img@id="imgmap" node', address: [object HTMLImageElement], role: image map, address: [xpconnect wrapped nsIAccessible]]. - got 0, expected 2
Comment 14 Treeherder Robot 2012-04-26 19:43:09 PDT
ryanvm%gmail.com
https://tbpl.mozilla.org/php/getParsedLog.php?id=11248734&tree=Mozilla-Inbound
Rev3 WINNT 5.1 mozilla-inbound opt test mochitest-other on 2012-04-26 16:58:31
slave: talos-r3-xp-020

20710 ERROR TEST-UNEXPECTED-FAIL | chrome://mochitests/content/a11y/accessible/tree/test_img.html | Different amount of expected children of ['img@id="imgmap" node', address: [object HTMLImageElement], role: image map, address: [xpconnect wrapped nsIAccessible]]. - got 0, expected 2
Comment 15 Treeherder Robot 2012-04-28 13:50:26 PDT
philor
https://tbpl.mozilla.org/php/getParsedLog.php?id=11297974&tree=Mozilla-Inbound
Rev3 Fedora 12 mozilla-inbound pgo test mochitest-other on 2012-04-28 13:12:06
slave: talos-r3-fed-042

20655 ERROR TEST-UNEXPECTED-FAIL | chrome://mochitests/content/a11y/accessible/tree/test_img.html | Different amount of expected children of ['img@id="imgmap" node', address: [object HTMLImageElement], role: image map, address: [xpconnect wrapped nsIAccessible]]. - got 0, expected 2
Comment 16 Treeherder Robot 2012-04-28 22:34:23 PDT
philor
https://tbpl.mozilla.org/php/getParsedLog.php?id=11302380&tree=Mozilla-Inbound
Rev3 Fedora 12 mozilla-inbound pgo test mochitest-other on 2012-04-28 21:57:42
slave: talos-r3-fed-058

20655 ERROR TEST-UNEXPECTED-FAIL | chrome://mochitests/content/a11y/accessible/tree/test_img.html | Different amount of expected children of ['img@id="imgmap" node', address: [object HTMLImageElement], role: image map, address: [xpconnect wrapped nsIAccessible]]. - got 0, expected 2
Comment 17 Treeherder Robot 2012-04-30 05:02:32 PDT
edmorley
https://tbpl.mozilla.org/php/getParsedLog.php?id=11321254&tree=Mozilla-Inbound
Rev3 Fedora 12 mozilla-inbound pgo test mochitest-other on 2012-04-30 03:58:35
slave: talos-r3-fed-069

TEST-UNEXPECTED-FAIL | chrome://mochitests/content/browser/browser/components/shell/test/browser_420786.js | an unexpected uncaught JS exception reported through window.onerror - NS_ERROR_FAILURE: Component returned failure code: 0x80004005 (NS_ERROR_FAILURE) [nsIGConfService.getString] at chrome://mochitests/content/browser/browser/components/shell/test/browser_420786.js:37
TEST-UNEXPECTED-FAIL | chrome://mochitests/content/browser/browser/components/shell/test/browser_420786.js | Test timed out
TEST-UNEXPECTED-FAIL | chrome://mochitests/content/browser/browser/components/shell/test/browser_420786.js | Found a tab after previous test timed out: about:logo
TEST-UNEXPECTED-FAIL | chrome://mochitests/content/browser/browser/components/shell/test/browser_633221.js | we got here and are the default browser
20656 ERROR TEST-UNEXPECTED-FAIL | chrome://mochitests/content/a11y/accessible/tree/test_img.html | Different amount of expected children of ['img@id="imgmap" node', address: [object HTMLImageElement], role: image map, address: [xpconnect wrapped nsIAccessible]]. - got 0, expected 2
Comment 18 Treeherder Robot 2012-05-01 15:48:08 PDT
philor
https://tbpl.mozilla.org/php/getParsedLog.php?id=11368727&tree=Profiling
Rev3 WINNT 6.1 profiling opt test mochitest-other on 2012-05-01 14:18:16
slave: talos-r3-w7-073

TEST-UNEXPECTED-FAIL | chrome://mochitests/content/browser/toolkit/mozapps/plugins/tests/browser_bug435788.js | Should have been a successful install - Got Failed, expected Installed
20712 ERROR TEST-UNEXPECTED-FAIL | chrome://mochitests/content/a11y/accessible/tree/test_img.html | Different amount of expected children of ['img@id="imgmap" node', address: [object HTMLImageElement], role: image map, address: [xpconnect wrapped nsIAccessible]]. - got 0, expected 2
Comment 19 Treeherder Robot 2012-05-01 18:41:53 PDT
jgilbert
https://tbpl.mozilla.org/php/getParsedLog.php?id=11374579&tree=Try
Rev3 Fedora 12 try opt test mochitest-other on 2012-05-01 17:58:06
slave: talos-r3-fed-053

20656 ERROR TEST-UNEXPECTED-FAIL | chrome://mochitests/content/a11y/accessible/tree/test_img.html | Different amount of expected children of ['img@id="imgmap" node', address: [object HTMLImageElement], role: image map, address: [xpconnect wrapped nsIAccessible]]. - got 0, expected 2
Comment 20 Treeherder Robot 2012-05-02 06:13:10 PDT
bbondy
https://tbpl.mozilla.org/php/getParsedLog.php?id=11378406&tree=Try
Rev3 WINNT 5.1 try opt test mochitest-other on 2012-05-01 21:11:56
slave: talos-r3-xp-052

20709 ERROR TEST-UNEXPECTED-FAIL | chrome://mochitests/content/a11y/accessible/tree/test_img.html | Different amount of expected children of ['img@id="imgmap" node', address: [object HTMLImageElement], role: image map, address: [xpconnect wrapped nsIAccessible]]. - got 0, expected 2
Comment 21 Treeherder Robot 2012-05-02 07:49:21 PDT
edmorley
https://tbpl.mozilla.org/php/getParsedLog.php?id=11388641&tree=Mozilla-Inbound
Rev3 Fedora 12 mozilla-inbound pgo test mochitest-other on 2012-05-02 07:00:03
slave: talos-r3-fed-004

20655 ERROR TEST-UNEXPECTED-FAIL | chrome://mochitests/content/a11y/accessible/tree/test_img.html | Different amount of expected children of ['img@id="imgmap" node', address: [object HTMLImageElement], role: image map, address: [xpconnect wrapped nsIAccessible]]. - got 0, expected 2
Comment 22 Treeherder Robot 2012-05-03 02:43:36 PDT
edmorley
https://tbpl.mozilla.org/php/getParsedLog.php?id=11419874&tree=Mozilla-Inbound
Rev3 Fedora 12x64 mozilla-inbound opt test mochitest-other on 2012-05-03 02:05:18
slave: talos-r3-fed64-004

20691 ERROR TEST-UNEXPECTED-FAIL | chrome://mochitests/content/a11y/accessible/tree/test_img.html | Different amount of expected children of ['img@id="imgmap" node', address: [object HTMLImageElement], role: image map, address: [xpconnect wrapped nsIAccessible]]. - got 0, expected 2
Comment 23 Treeherder Robot 2012-05-04 09:37:54 PDT
philor
https://tbpl.mozilla.org/php/getParsedLog.php?id=11468342&tree=Mozilla-Aurora
Rev3 WINNT 5.1 mozilla-aurora pgo test mochitest-other on 2012-05-04 08:08:10
slave: talos-r3-xp-012

20735 ERROR TEST-UNEXPECTED-FAIL | chrome://mochitests/content/a11y/accessible/tree/test_img.html | Different amount of expected children of ['img@id="imgmap" node', address: [object HTMLImageElement], role: image map, address: [xpconnect wrapped nsIAccessible]]. - got 0, expected 2
Comment 24 Treeherder Robot 2012-05-06 18:42:36 PDT
philor
https://tbpl.mozilla.org/php/getParsedLog.php?id=11518561&tree=Firefox
Rev3 Fedora 12x64 mozilla-central opt test mochitest-other on 2012-05-06 18:04:32
slave: talos-r3-fed64-057

20691 ERROR TEST-UNEXPECTED-FAIL | chrome://mochitests/content/a11y/accessible/tree/test_img.html | Different amount of expected children of ['img@id="imgmap" node', address: [object HTMLImageElement], role: image map, address: [xpconnect wrapped nsIAccessible]]. - got 0, expected 2
Comment 25 Treeherder Robot 2012-05-06 18:42:38 PDT
ryanvm%gmail.com
https://tbpl.mozilla.org/php/getParsedLog.php?id=11518561&tree=Firefox
Rev3 Fedora 12x64 mozilla-central opt test mochitest-other on 2012-05-06 18:04:32
slave: talos-r3-fed64-057

20691 ERROR TEST-UNEXPECTED-FAIL | chrome://mochitests/content/a11y/accessible/tree/test_img.html | Different amount of expected children of ['img@id="imgmap" node', address: [object HTMLImageElement], role: image map, address: [xpconnect wrapped nsIAccessible]]. - got 0, expected 2
Comment 26 Treeherder Robot 2012-05-09 00:15:26 PDT
edmorley
https://tbpl.mozilla.org/php/getParsedLog.php?id=11588890&tree=Profiling
Rev3 Fedora 12x64 profiling opt test mochitest-other on 2012-05-08 18:02:09
slave: talos-r3-fed64-053

20714 ERROR TEST-UNEXPECTED-FAIL | chrome://mochitests/content/a11y/accessible/tree/test_img.html | Different amount of expected children of ['img@id="imgmap" node', address: [object HTMLImageElement], role: image map, address: [xpconnect wrapped nsIAccessible]]. - got 0, expected 2
Comment 27 Treeherder Robot 2012-05-10 18:58:49 PDT
bbondy
https://tbpl.mozilla.org/php/getParsedLog.php?id=11660434&tree=Try
Rev3 WINNT 6.1 try opt test mochitest-other on 2012-05-10 16:49:01
slave: talos-r3-w7-072

20770 ERROR TEST-UNEXPECTED-FAIL | chrome://mochitests/content/a11y/accessible/tree/test_img.html | Different amount of expected children of ['img@id="imgmap" node', address: [object HTMLImageElement], role: image map, address: [xpconnect wrapped nsIAccessible]]. - got 0, expected 2
Comment 28 Treeherder Robot 2012-05-10 21:17:55 PDT
philor
https://tbpl.mozilla.org/php/getParsedLog.php?id=11666366&tree=Profiling
Rev3 WINNT 6.1 profiling opt test mochitest-other on 2012-05-10 20:19:24
slave: talos-r3-w7-027

20800 ERROR TEST-UNEXPECTED-FAIL | chrome://mochitests/content/a11y/accessible/tree/test_img.html | Different amount of expected children of ['img@id="imgmap" node', address: [object HTMLImageElement], role: image map, address: [xpconnect wrapped nsIAccessible]]. - got 0, expected 2
Comment 29 Treeherder Robot 2012-05-11 05:44:26 PDT
edmorley
https://tbpl.mozilla.org/php/getParsedLog.php?id=11673297&tree=Profiling
Rev3 WINNT 6.1 profiling opt test mochitest-other on 2012-05-11 04:03:20
slave: talos-r3-w7-020

20800 ERROR TEST-UNEXPECTED-FAIL | chrome://mochitests/content/a11y/accessible/tree/test_img.html | Different amount of expected children of ['img@id="imgmap" node', address: [object HTMLImageElement], role: image map, address: [xpconnect wrapped nsIAccessible]]. - got 0, expected 2
Comment 30 Treeherder Robot 2012-05-11 11:55:18 PDT
msucan
https://tbpl.mozilla.org/php/getParsedLog.php?id=11681109&tree=Try
Rev3 WINNT 6.1 try opt test mochitest-other on 2012-05-11 10:36:25
slave: talos-r3-w7-015

TEST-UNEXPECTED-FAIL | chrome://mochitests/content/browser/browser/components/tabview/test/browser_tabview_bug669694.js | Test timed out
20770 ERROR TEST-UNEXPECTED-FAIL | chrome://mochitests/content/a11y/accessible/tree/test_img.html | Different amount of expected children of ['img@id="imgmap" node', address: [object HTMLImageElement], role: image map, address: [xpconnect wrapped nsIAccessible]]. - got 0, expected 2
Comment 31 Treeherder Robot 2012-05-11 14:32:12 PDT
mbrubeck
https://tbpl.mozilla.org/php/getParsedLog.php?id=11687088&tree=Mozilla-Inbound
Rev3 WINNT 6.1 mozilla-inbound opt test mochitest-other on 2012-05-11 13:36:02
slave: talos-r3-w7-011

20800 ERROR TEST-UNEXPECTED-FAIL | chrome://mochitests/content/a11y/accessible/tree/test_img.html | Different amount of expected children of ['img@id="imgmap" node', address: [object HTMLImageElement], role: image map, address: [xpconnect wrapped nsIAccessible]]. - got 0, expected 2
Comment 32 Treeherder Robot 2012-05-11 15:28:07 PDT
philor
https://tbpl.mozilla.org/php/getParsedLog.php?id=11687944&tree=Profiling
Rev3 Fedora 12 profiling opt test mochitest-other on 2012-05-11 14:10:06
slave: talos-r3-fed-031

20744 ERROR TEST-UNEXPECTED-FAIL | chrome://mochitests/content/a11y/accessible/tree/test_img.html | Different amount of expected children of ['img@id="imgmap" node', address: [object HTMLImageElement], role: image map, address: [xpconnect wrapped nsIAccessible]]. - got 0, expected 2
Comment 33 Treeherder Robot 2012-05-14 12:47:36 PDT
edmorley
https://tbpl.mozilla.org/php/getParsedLog.php?id=11732035&tree=Mozilla-Inbound
Rev3 Fedora 12x64 mozilla-inbound opt test mochitest-other on 2012-05-14 12:02:17
slave: talos-r3-fed64-047

20759 ERROR TEST-UNEXPECTED-FAIL | chrome://mochitests/content/a11y/accessible/tree/test_img.html | Different amount of expected children of ['img@id="imgmap" node', address: [object HTMLImageElement], role: image map, address: [xpconnect wrapped nsIAccessible]]. - got 0, expected 2
Comment 34 Treeherder Robot 2012-05-15 10:17:13 PDT
philor
https://tbpl.mozilla.org/php/getParsedLog.php?id=11768353&tree=Mozilla-Aurora
Rev3 Fedora 12x64 mozilla-aurora pgo test mochitest-other on 2012-05-15 09:35:48
slave: talos-r3-fed64-023

20681 ERROR TEST-UNEXPECTED-FAIL | chrome://mochitests/content/a11y/accessible/tree/test_img.html | Different amount of expected children of ['img@id="imgmap" node', address: [object HTMLImageElement], role: image map, address: [xpconnect wrapped nsIAccessible]]. - got 0, expected 2
Comment 35 Nagarjuna Varma [:Infinity] 2012-05-15 13:05:40 PDT
Created attachment 624159 [details] [diff] [review]
Patchv1

Tests failed locally.
The following tests have failed:
chrome://mochitests/content/a11y/accessible/treeupdate/test_list_editabledoc.html
chrome://mochitests/content/a11y/accessible/tree/test_img.html
chrome://mochitests/content/a11y/accessible/states/test_aria_imgmap.html
chrome://mochitests/content/a11y/accessible/relations/test_tabbrowser.xul
chrome://mochitests/content/a11y/accessible/events/test_scroll.xul

I have talked to tbsaunde and capella about it. We think there is some problem running the tests locally. Could you help me out with this!
Comment 36 Treeherder Robot 2012-05-15 22:18:55 PDT
Aryeh Gregor
https://tbpl.mozilla.org/php/getParsedLog.php?id=11756110&tree=Try
Rev3 Fedora 12x64 try opt test mochitest-other on 2012-05-15 01:28:57
slave: talos-r3-fed64-018

20759 ERROR TEST-UNEXPECTED-FAIL | chrome://mochitests/content/a11y/accessible/tree/test_img.html | Different amount of expected children of ['img@id="imgmap" node', address: [object HTMLImageElement], role: image map, address: [xpconnect wrapped nsIAccessible]]. - got 0, expected 2
Comment 37 alexander :surkov 2012-05-16 00:25:17 PDT
Comment on attachment 624159 [details] [diff] [review]
Patchv1

Review of attachment 624159 [details] [diff] [review]:
-----------------------------------------------------------------

you should include missed EventUtils.js to make it working. (I'll fix this before landing)
Comment 39 Treeherder Robot 2012-05-16 04:51:54 PDT
paul
https://tbpl.mozilla.org/php/getParsedLog.php?id=11794521&tree=Try
Rev3 Fedora 12x64 try opt test mochitest-other on 2012-05-16 03:40:22
slave: talos-r3-fed64-062

20744 ERROR TEST-UNEXPECTED-FAIL | chrome://mochitests/content/a11y/accessible/tree/test_img.html | Different amount of expected children of ['img@id="imgmap" node', address: [object HTMLImageElement], role: image map, address: [xpconnect wrapped nsIAccessible]]. - got 0, expected 2
Comment 40 Ryan VanderMeulen [:RyanVM] 2012-05-16 19:30:12 PDT
https://hg.mozilla.org/mozilla-central/rev/9915fc274c16

Note You need to log in before you can comment on or make changes to this bug.