No rule to make target `../../dist/bin/defaults/profile/bookmarks.html', needed by `libs'

RESOLVED WORKSFORME

Status

Firefox Build System
General
RESOLVED WORKSFORME
6 years ago
5 months ago

People

(Reporter: emorley, Unassigned)

Tracking

(Blocks: 1 bug)

Trunk
x86
Windows 7

Firefox Tracking Flags

(Not tracked)

Details

Another, "we shouldn't have to clobber this".

WINNT 5.2 mozilla-central leak test build on 2012-06-14 23:24:29 PDT for push c1c12246f5ac

slave: w64-ix-slave19

https://tbpl.mozilla.org/php/getParsedLog.php?id=12689110&tree=Firefox

{
make[7]: Entering directory `/e/builds/moz2_slave/m-cen-w32-dbg/build/obj-firefox/browser/fuel/test'
e:/builds/moz2_slave/m-cen-w32-dbg/build/obj-firefox/config/nsinstall.exe "/e/builds/moz2_slave/m-cen-w32-dbg/build/browser/fuel/test/browser_Application.js" "/e/builds/moz2_slave/m-cen-w32-dbg/build/browser/fuel/test/browser_ApplicationPrefs.js" "/e/builds/moz2_slave/m-cen-w32-dbg/build/browser/fuel/test/browser_ApplicationStorage.js" "/e/builds/moz2_slave/m-cen-w32-dbg/build/browser/fuel/test/browser_ApplicationQuitting.js" "/e/builds/moz2_slave/m-cen-w32-dbg/build/browser/fuel/test/browser_Bookmarks.js" "/e/builds/moz2_slave/m-cen-w32-dbg/build/browser/fuel/test/browser_Browser.js" "/e/builds/moz2_slave/m-cen-w32-dbg/build/browser/fuel/test/ContentA.html" "/e/builds/moz2_slave/m-cen-w32-dbg/build/browser/fuel/test/ContentB.html" "/e/builds/moz2_slave/m-cen-w32-dbg/build/browser/fuel/test/ContentWithFrames.html" ../../../_tests/testing/mochitest/browser/browser/fuel/test
make[7]: Leaving directory `/e/builds/moz2_slave/m-cen-w32-dbg/build/obj-firefox/browser/fuel/test'
make[6]: Leaving directory `/e/builds/moz2_slave/m-cen-w32-dbg/build/obj-firefox/browser/fuel'
make[6]: Entering directory `/e/builds/moz2_slave/m-cen-w32-dbg/build/obj-firefox/browser/locales'
set -e;   \
	for i in /e/builds/moz2_slave/m-cen-w32-dbg/build/browser/locales/en-US/firefox-l10n.js; do \
	  dest=../../dist/bin/defaults/preferences/`basename $i`; \
	  rm -f -f $dest; \
	  /e/builds/moz2_slave/m-cen-w32-dbg/build/obj-firefox/_virtualenv/Scripts/python.exe /e/builds/moz2_slave/m-cen-w32-dbg/build/config/Preprocessor.py --line-endings=crlf -DAB_CD=en-US -DMOZ_LANGPACK_EID=langpack-en-US@firefox.mozilla.org -DMOZ_APP_VERSION=16.0a1 -DMOZ_APP_MAXVERSION=16.0a1 -DLOCALE_SRCDIR=/e/builds/moz2_slave/m-cen-w32-dbg/build/browser/locales/en-US -DPKG_BASENAME="firefox-16.0a1.en-US.win32" -DPKG_INST_BASENAME="firefox-16.0a1.en-US.win32.installer"  -DDLL_PREFIX= -DDLL_SUFFIX=.dll -DBIN_SUFFIX=.exe -D_CRT_SECURE_NO_WARNINGS=1 -D_CRT_NONSTDC_NO_WARNINGS=1 -DHAVE_SEH_EXCEPTIONS=1 -DHAVE_WINSDKVER_H=1 -DMOZ_MSVC_STL_WRAP__RAISE=1 -DWINVER=0x502 -D_WIN32_WINNT=0x502 -D_WIN32_IE=0x0603 -DMOZ_WINSDK_TARGETVER=0x06010000 -DMOZ_NTDDI_WIN7=0x06010000 -DHAVE_IO_H=1 -DHAVE_SETBUF=1 -DHAVE_ISATTY=1 -DX_DISPLAY_MISSING=1 -DMOZ_ENABLE_PROFILER_SPS=1 -DMOZILLA_VERSION=\"16.0a1\" -DMOZILLA_VERSION_U=16.0a1 -DMOZILLA_UAVERSION=\"16.0\" -DHAVE_SNPRINTF=1 -D_WINDOWS=1 -DWIN32=1 -DXP_WIN=1 -DXP_WIN32=1 -DHW_THREADS=1 -DSTDC_HEADERS=1 -DWIN32_LEAN_AND_MEAN=1 -DNO_X11=1 -DHAVE_STDCALL=1 -DHAVE_MMINTRIN_H=1 -D_X86_=1 -DD_INO=d_ino -DNS_ALWAYS_INLINE= -DNS_ATTR_MALLOC= -DNS_WARN_UNUSED_RESULT= -DMALLOC_H=\<malloc.h\> -DHAVE_FORCEINLINE=1 -DHAVE_LOCALECONV=1 -DNS_ENABLE_TSF=1 -DMOZ_PHOENIX=1 -DMOZ_BUILD_APP=browser -DMOZ_PDF_PRINTING=1 -DMOZ_INSTRUMENT_EVENT_LOOP=1 -DMOZ_DISTRIBUTION_ID=\"org.mozilla\" -DIBMBIDI=1 -DACCESSIBILITY=1 -DNS_PRINTING=1 -DNS_PRINT_PREVIEW=1 -DMOZ_OGG=1 -DMOZ_WEBM=1 -DVPX_X86_ASM=1 -DMOZ_WAVE=1 -DMOZ_SYDNEYAUDIO=1 -DMOZ_SPEEX_RESAMPLER=1 -DMOZ_CUBEB=1 -DMOZ_MEDIA=1 -DMOZ_VORBIS=1 -DMOZ_OPUS=1 -DMOZ_XTF=1 -DENABLE_SYSTEM_EXTENSION_DIRS=1 -DMOZ_CRASHREPORTER=1 -DMOZ_CRASHREPORTER_ENABLE_PERCENT=100 -DLIBJPEG_TURBO_X86_ASM=1 -DMOZ_WEBAPP_RUNTIME=1 -DMOZ_SIGNING=1 -DMOZ_MAINTENANCE_SERVICE=1 -DMOZ_VERIFY_MAR_SIGNATURE=1 -DMOZ_ENABLE_SIGNMAR=1 -DMOZ_UPDATER=1 -DMOZ_UPDATE_CHANNEL=default -DMOZ_FEEDS=1 -DMOZ_SAFE_BROWSING=1 -DMOZ_URL_CLASSIFIER=1 -DMOZ_DEBUG_SYMBOLS=1 -DMOZ_LOGGING=1 -DMOZ_DUMP_PAINTING=1 -DNS_TRACE_MALLOC=1 -DJSGC_INCREMENTAL=1 -DJS_DEFAULT_JITREPORT_GRANULARITY=3 -DMOZ_OMNIJAR=1 -DMOZ_USER_DIR=\"Mozilla\" -DMOZ_TREE_PIXMAN=1 -DHAVE_STDINT_H=1 -DMOZ_TREE_CAIRO=1 -DHAVE_UINT64_T=1 -DMOZ_GRAPHITE=1 -DMOZ_XUL=1 -DMOZ_PROFILELOCKING=1 -DBUILD_CTYPES=1 -DMOZ_PLACES=1 -DMOZ_SERVICES_SYNC=1 -DMOZ_MACBUNDLE_ID=org.mozilla.nightlydebug -DMOZ_APP_UA_NAME=\"\" -DMOZ_APP_UA_VERSION=\"16.0a1\" -DMOZ_UA_FIREFOX_VERSION=\"16.0a1\" -DFIREFOX_VERSION=16.0a1 -DMOZ_DLL_SUFFIX=\".dll\" -DMOZ_REFLOW_PERF=1 -DMOZ_REFLOW_PERF_DSP=1  -DDEBUG -D_DEBUG -DTRACING $i > $dest; \
	done
/e/builds/moz2_slave/m-cen-w32-dbg/build/obj-firefox/_virtualenv/Scripts/python.exe /e/builds/moz2_slave/m-cen-w32-dbg/build/config/JarMaker.py \
	   -j ../../dist/bin/chrome \
	  -t /e/builds/moz2_slave/m-cen-w32-dbg/build -f flat  -c /e/builds/moz2_slave/m-cen-w32-dbg/build/browser/locales/en-US -DDEBUG -D_DEBUG -DTRACING -DAB_CD=en-US -DMOZ_LANGPACK_EID=langpack-en-US@firefox.mozilla.org -DMOZ_APP_VERSION=16.0a1 -DMOZ_APP_MAXVERSION=16.0a1 -DLOCALE_SRCDIR=/e/builds/moz2_slave/m-cen-w32-dbg/build/browser/locales/en-US -DPKG_BASENAME="firefox-16.0a1.en-US.win32" -DPKG_INST_BASENAME="firefox-16.0a1.en-US.win32.installer"  -DDLL_PREFIX= -DDLL_SUFFIX=.dll -DBIN_SUFFIX=.exe -D_CRT_SECURE_NO_WARNINGS=1 -D_CRT_NONSTDC_NO_WARNINGS=1 -DHAVE_SEH_EXCEPTIONS=1 -DHAVE_WINSDKVER_H=1 -DMOZ_MSVC_STL_WRAP__RAISE=1 -DWINVER=0x502 -D_WIN32_WINNT=0x502 -D_WIN32_IE=0x0603 -DMOZ_WINSDK_TARGETVER=0x06010000 -DMOZ_NTDDI_WIN7=0x06010000 -DHAVE_IO_H=1 -DHAVE_SETBUF=1 -DHAVE_ISATTY=1 -DX_DISPLAY_MISSING=1 -DMOZ_ENABLE_PROFILER_SPS=1 -DMOZILLA_VERSION=\"16.0a1\" -DMOZILLA_VERSION_U=16.0a1 -DMOZILLA_UAVERSION=\"16.0\" -DHAVE_SNPRINTF=1 -D_WINDOWS=1 -DWIN32=1 -DXP_WIN=1 -DXP_WIN32=1 -DHW_THREADS=1 -DSTDC_HEADERS=1 -DWIN32_LEAN_AND_MEAN=1 -DNO_X11=1 -DHAVE_STDCALL=1 -DHAVE_MMINTRIN_H=1 -D_X86_=1 -DD_INO=d_ino -DNS_ALWAYS_INLINE= -DNS_ATTR_MALLOC= -DNS_WARN_UNUSED_RESULT= -DMALLOC_H=\<malloc.h\> -DHAVE_FORCEINLINE=1 -DHAVE_LOCALECONV=1 -DNS_ENABLE_TSF=1 -DMOZ_PHOENIX=1 -DMOZ_BUILD_APP=browser -DMOZ_PDF_PRINTING=1 -DMOZ_INSTRUMENT_EVENT_LOOP=1 -DMOZ_DISTRIBUTION_ID=\"org.mozilla\" -DIBMBIDI=1 -DACCESSIBILITY=1 -DNS_PRINTING=1 -DNS_PRINT_PREVIEW=1 -DMOZ_OGG=1 -DMOZ_WEBM=1 -DVPX_X86_ASM=1 -DMOZ_WAVE=1 -DMOZ_SYDNEYAUDIO=1 -DMOZ_SPEEX_RESAMPLER=1 -DMOZ_CUBEB=1 -DMOZ_MEDIA=1 -DMOZ_VORBIS=1 -DMOZ_OPUS=1 -DMOZ_XTF=1 -DENABLE_SYSTEM_EXTENSION_DIRS=1 -DMOZ_CRASHREPORTER=1 -DMOZ_CRASHREPORTER_ENABLE_PERCENT=100 -DLIBJPEG_TURBO_X86_ASM=1 -DMOZ_WEBAPP_RUNTIME=1 -DMOZ_SIGNING=1 -DMOZ_MAINTENANCE_SERVICE=1 -DMOZ_VERIFY_MAR_SIGNATURE=1 -DMOZ_ENABLE_SIGNMAR=1 -DMOZ_UPDATER=1 -DMOZ_UPDATE_CHANNEL=default -DMOZ_FEEDS=1 -DMOZ_SAFE_BROWSING=1 -DMOZ_URL_CLASSIFIER=1 -DMOZ_DEBUG_SYMBOLS=1 -DMOZ_LOGGING=1 -DMOZ_DUMP_PAINTING=1 -DNS_TRACE_MALLOC=1 -DJSGC_INCREMENTAL=1 -DJS_DEFAULT_JITREPORT_GRANULARITY=3 -DMOZ_OMNIJAR=1 -DMOZ_USER_DIR=\"Mozilla\" -DMOZ_TREE_PIXMAN=1 -DHAVE_STDINT_H=1 -DMOZ_TREE_CAIRO=1 -DHAVE_UINT64_T=1 -DMOZ_GRAPHITE=1 -DMOZ_XUL=1 -DMOZ_PROFILELOCKING=1 -DBUILD_CTYPES=1 -DMOZ_PLACES=1 -DMOZ_SERVICES_SYNC=1 -DMOZ_MACBUNDLE_ID=org.mozilla.nightlydebug -DMOZ_APP_UA_NAME=\"\" -DMOZ_APP_UA_VERSION=\"16.0a1\" -DMOZ_UA_FIREFOX_VERSION=\"16.0a1\" -DFIREFOX_VERSION=16.0a1 -DMOZ_DLL_SUFFIX=\".dll\" -DMOZ_REFLOW_PERF=1 -DMOZ_REFLOW_PERF_DSP=1  \
	  /e/builds/moz2_slave/m-cen-w32-dbg/build/browser/locales/jar.mn
processing e:/builds/moz2_slave/m-cen-w32-dbg/build/browser/locales/jar.mn
make[6]: Leaving directory `/e/builds/moz2_slave/m-cen-w32-dbg/build/obj-firefox/browser/locales'
make[5]: Leaving directory `/e/builds/moz2_slave/m-cen-w32-dbg/build/obj-firefox/browser'
make[4]: Leaving directory `/e/builds/moz2_slave/m-cen-w32-dbg/build/obj-firefox'
make[3]: Leaving directory `/e/builds/moz2_slave/m-cen-w32-dbg/build/obj-firefox'
make[2]: Leaving directory `/e/builds/moz2_slave/m-cen-w32-dbg/build/obj-firefox'
make[1]: Leaving directory `/e/builds/moz2_slave/m-cen-w32-dbg/build'
make[6]: *** No rule to make target `../../dist/bin/defaults/profile/bookmarks.html', needed by `libs'.  Stop.
make[5]: *** [locales_libs] Error 2
make[4]: *** [libs_tier_app] Error 2
make[3]: *** [tier_app] Error 2
make[2]: *** [default] Error 2
make[1]: *** [realbuild] Error 2
make: *** [build] Error 2
}
Looks like some make snafu, because the Makefile reads:

%/defaults/profile/bookmarks.html: bookmarks.inc generic/profile/bookmarks.html.in
        (...)

libs:: $(FINAL_TARGET)/defaults/profile/bookmarks.html ;

So the target *does* exist.

Maybe it would be more happy with $(FINAL_TARGET)/defaults/profile/bookmarks.html $(DESTDIR)$(mozappdir)/defaults/profile/bookmarks.html: %/defaults/profile/bookmarks.html: bookmarks.inc generic/profile/bookmarks.html.in
Blocks: 941904
Status: NEW → RESOLVED
Last Resolved: 4 years ago
Resolution: --- → WORKSFORME

Updated

5 months ago
Product: Core → Firefox Build System
You need to log in before you can comment on or make changes to this bug.