Closed Bug 966156 Opened 11 years ago Closed 11 years ago

Intermittent gaia-integration make: *** [b2g] Error 126 in npm install

Categories

(Firefox OS Graveyard :: Gaia, defect)

x86
Linux
defect
Not set
normal

Tracking

(Not tracked)

RESOLVED WORKSFORME

People

(Reporter: philor, Unassigned)

References

Details

(Keywords: intermittent-failure)

https://tbpl.mozilla.org/php/getParsedLog.php?id=33850748&tree=B2g-Inbound
b2g_ubuntu32_vm b2g-inbound opt test gaia-integration on 2014-01-30 18:24:31 PST for push 666164e66db2
slave: tst-linux32-spot-075

8:40:38     INFO -  npm http 200 http://npm-mirror.pub.build.mozilla.org/mail-fakeservers/0.0.13/mail-fakeservers-0.0.13.tgz
18:45:39     INFO - mozprocess timed out
18:45:39    ERROR - timed out after 300 seconds of no output
18:45:39    ERROR - Return code: -9
18:45:39     INFO - retry: Failed, sleeping 60 seconds before retrying
...
18:48:33     INFO -  npm http 304 http://npm-mirror.pub.build.mozilla.org/sigmund
18:53:33     INFO - mozprocess timed out
18:53:33    ERROR - timed out after 300 seconds of no output
18:53:33    ERROR - Return code: -9
18:53:33     INFO - retry: Failed, sleeping 120 seconds before retrying
...
18:55:36     INFO -  npm WARN package.json mocha-json-proxy@0.0.7 No repository field.
18:55:37     INFO -  touch node_modules/.bin/mozilla-download node_modules/.bin/jshint node_modules/.bin/mocha
18:55:37     INFO -  ./node_modules/.bin/mozilla-download  \
18:55:37     INFO -  		--verbose \
18:55:37     INFO -  		--product b2g \
18:55:37     INFO -  		--channel tinderbox \
18:55:37     INFO -  		--branch mozilla-central b2g
18:55:37     INFO -  /bin/bash: line 1: ./node_modules/.bin/mozilla-download: Permission denied
18:55:37     INFO -  make: *** [b2g] Error 126
18:55:37    ERROR - Return code: 2
18:55:37     INFO - TinderboxPrint: gaia-integration-tests: <em class="testfail">T-FAIL</em>
18:55:37    ERROR - Tests exited with return code 2: harness failures
18:55:37    ERROR - # TBPL FAILURE #
No longer doing 'npm install' on buildbot.
Status: NEW → RESOLVED
Closed: 11 years ago
Resolution: --- → WORKSFORME
You need to log in before you can comment on or make changes to this bug.