Intermittent No rule to make target header.py, needed by `xpcAccEvents.cpp'

RESOLVED FIXED in Firefox 33

Status

RESOLVED FIXED
4 years ago
8 months ago

People

(Reporter: nigelb, Assigned: glandium)

Tracking

({intermittent-failure})

Trunk
mozilla33
x86_64
Linux
intermittent-failure

Firefox Tracking Flags

(firefox31 unaffected, firefox32 unaffected, firefox33 fixed, firefox-esr24 unaffected)

Details

(URL)

Attachments

(1 attachment)

(Reporter)

Description

4 years ago
b2g_mozilla-inbound_emulator-jb_dep on 2014-06-25 19:13:08 PDT for push f3e706953551

slave: bld-linux64-spot-108

https://tbpl.mozilla.org/php/getParsedLog.php?id=42492435&tree=Mozilla-Inbound

19:19:07    ERROR -  make[6]: *** No rule to make target `/builds/slave/b2g_m-in_emu-jb_dep-0000000000/build/objdir-gecko/dist/sdk/bin/header.py', needed by `xpcAccEvents.cpp'.  Stop.
19:19:07    ERROR -  make[5]: *** [accessible/xpcom/export] Error 2
19:19:07     INFO -  make[5]: *** Waiting for unfinished jobs....
19:19:07     INFO -  There are no private exports.
19:19:07     INFO -  cd include; make private_export
19:19:07     INFO -  Tracing dependencies for: panels/keyboard_enabled_layouts/panel
19:19:07     INFO -  cd pkix; make private_export
19:19:07     INFO -  Tracing dependencies for: panels/keyboard_enabled_default/dialog
19:19:07     INFO -  Tracing dependencies for: panels/app_storage/panel
19:19:07     INFO -  cd certsel; make private_export
19:19:07     INFO -  execute wallpaper/build/build.js
19:19:07     INFO -  cd crlsel; make private_export

19:19:09     INFO -  There are no private exports.
19:19:09     INFO -  copy music2 to build_stage/
19:19:09    ERROR -  make[4]: *** [export] Error 2
19:19:09    ERROR -  make[3]: *** [default] Error 2
19:19:09    ERROR -  make[2]: *** [realbuild] Error 2
19:19:09    ERROR -  make[1]: *** [build] Error 2
19:19:09     INFO -  make: *** [out/target/product/generic/obj/DATA/gecko_intermediates/gecko] Error 2
19:19:09     INFO -  make: *** Waiting for unfinished jobs....
19:19:09     INFO -  Uglify2 file: /builds/slave/b2g_m-in_emu-jb_dep-0000000000/build/gaia/build_stage/email/js/cards/settings_main.js
19:19:09     INFO -  execute music2/build/build.js
19:19:09     INFO -  Uglify2 file: /builds/slave/b2g_m-in_emu-jb_dep-0000000000/build/gaia/build_stage/email/js/cards/compose.js
19:19:09     INFO -  run-js-command music2/app/build
19:19:10     INFO -  copy test-ime to build_stage/
19:19:10     INFO -  Uglify2 file: /builds/slave/b2g_m-in_emu-jb_dep-0000000000/build/gaia/build_stage/settings/js/bluetooth.js
19:19:10     INFO -  copy share-receiver to build_stage/
19:19:10     INFO -  style/timer.css
19:19:10     INFO -  ----------------
19:19:10     INFO -  style/timer.css
19:19:10     INFO -  style/alarm.css
19:19:10     INFO -  ----------------
19:19:10     INFO -  style/alarm.css
19:19:10     INFO -  style/clock.css
19:19:10     INFO -  ----------------
19:19:10     INFO -  style/../shared/style/switches.css
19:19:10     INFO -  style/../shared/style/input_areas.css
19:19:10     INFO -  style/../shared/style/buttons.css
19:19:10     INFO -  style/clock.css
19:19:10     INFO -  style/views.css
19:19:10     INFO -  ----------------
19:19:10     INFO -  style/views.css
19:19:10     INFO -  style/stopwatch.css
19:19:10     INFO -  ----------------
19:19:10     INFO -  style/stopwatch.css
19:19:10     INFO -  style/picker/picker.css
19:19:10     INFO -  ----------------
19:19:10     INFO -  style/picker/picker.css
19:19:10     INFO -  style/picker/value_selector.css
19:19:10     INFO -  ----------------
19:19:10     INFO -  style/picker/value_selector.css
19:19:10     INFO -  style/onring.css
19:19:10     INFO -  ----------------
19:19:10     INFO -  style/onring.css
19:19:10     INFO -  style/form_button.css
19:19:10     INFO -  ----------------
19:19:10     INFO -  style/form_button.css
19:19:10     INFO -  style/hacks.css
19:19:10     INFO -  ----------------

Skipping 4292 lines...

19:19:58     INFO -  /builds/slave/b2g_m-in_emu-jb_dep-0000000000/build/gaia/build_stage/geoloc/locales/geoloc.ru.properties could not be found.
19:19:58     INFO -  /build_stage/geoloc/index.html: [l10n] [ru]: 17 missing in the visible DOM: geolocation-tracker, geoloc-start, geoloc-stop, geoloc-clear, geoloc-save, geoloc-parameters, geoloc-timeout, geoloc-maxage, geoloc-msecs, geoloc-highaccuracy, geoloc-debug, geoloc-keep, geoloc-status, gps-fixes, last-fix, date-last-fix, geoloc-debug-log
19:19:58     INFO -  /build_stage/geoloc/index.html: [l10n] [ru]: 17 missing compared to en-US: geolocation-tracker, geoloc-start, geoloc-stop, geoloc-clear, geoloc-debug, geoloc-keep, geoloc-save, geoloc-parameters, geoloc-status, geoloc-debug-log, geoloc-timeout, geoloc-maxage, geoloc-highaccuracy, geoloc-msecs, gps-fixes, last-fix, date-last-fix
19:19:58     INFO -  /builds/slave/b2g_m-in_emu-jb_dep-0000000000/build/gaia/build_stage/geoloc/locales/geoloc.sk.properties could not be found.
19:19:58     INFO -  /build_stage/geoloc/index.html: [l10n] [sk]: 17 missing in the visible DOM: geolocation-tracker, geoloc-start, geoloc-stop, geoloc-clear, geoloc-save, geoloc-parameters, geoloc-timeout, geoloc-maxage, geoloc-msecs, geoloc-highaccuracy, geoloc-debug, geoloc-keep, geoloc-status, gps-fixes, last-fix, date-last-fix, geoloc-debug-log
19:19:58     INFO -  /build_stage/geoloc/index.html: [l10n] [sk]: 17 missing compared to en-US: geolocation-tracker, geoloc-start, geoloc-stop, geoloc-clear, geoloc-debug, geoloc-keep, geoloc-save, geoloc-parameters, geoloc-status, geoloc-debug-log, geoloc-timeout, geoloc-maxage, geoloc-highaccuracy, geoloc-msecs, gps-fixes, last-fix, date-last-fix
19:19:58     INFO -  /builds/slave/b2g_m-in_emu-jb_dep-0000000000/build/gaia/build_stage/geoloc/locales/geoloc.sq.properties could not be found.
19:19:58     INFO -  /build_stage/geoloc/index.html: [l10n] [sq]: 17 missing in the visible DOM: geolocation-tracker, geoloc-start, geoloc-stop, geoloc-clear, geoloc-save, geoloc-parameters, geoloc-timeout, geoloc-maxage, geoloc-msecs, geoloc-highaccuracy, geoloc-debug, geoloc-keep, geoloc-status, gps-fixes, last-fix, date-last-fix, geoloc-debug-log
19:19:58     INFO -  /build_stage/geoloc/index.html: [l10n] [sq]: 17 missing compared to en-US: geolocation-tracker, geoloc-start, geoloc-stop, geoloc-clear, geoloc-debug, geoloc-keep, geoloc-save, geoloc-parameters, geoloc-status, geoloc-debug-log, geoloc-timeout, geoloc-maxage, geoloc-highaccuracy, geoloc-msecs, gps-fixes, last-fix, date-last-fix
19:19:58     INFO -  /builds/slave/b2g_m-in_emu-jb_dep-0000000000/build/gaia/build_stage/geoloc/locales/geoloc.sr-Cyrl.properties could not be found.
19:19:58     INFO -  /build_stage/geoloc/index.html: [l10n] [sr-Cyrl]: 17 missing in the visible DOM: geolocation-tracker, geoloc-start, geoloc-stop, geoloc-clear, geoloc-save, geoloc-parameters, geoloc-timeout, geoloc-maxage, geoloc-msecs, geoloc-highaccuracy, geoloc-debug, geoloc-keep, geoloc-status, gps-fixes, last-fix, date-last-fix, geoloc-debug-log
19:19:58     INFO -  /build_stage/geoloc/index.html: [l10n] [sr-Cyrl]: 17 missing compared to en-US: geolocation-tracker, geoloc-start, geoloc-stop, geoloc-clear, geoloc-debug, geoloc-keep, geoloc-save, geoloc-parameters, geoloc-status, geoloc-debug-log, geoloc-timeout, geoloc-maxage, geoloc-highaccuracy, geoloc-msecs, gps-fixes, last-fix, date-last-fix
19:19:58     INFO -  /builds/slave/b2g_m-in_emu-jb_dep-0000000000/build/gaia/build_stage/geoloc/locales/geoloc.sr-Latn.properties could not be found.
19:19:58     INFO -  /build_stage/geoloc/index.html: [l10n] [sr-Latn]: 17 missing in the visible DOM: geolocation-tracker, geoloc-start, geoloc-stop, geoloc-clear, geoloc-save, geoloc-parameters, geoloc-timeout, geoloc-maxage, geoloc-msecs, geoloc-highaccuracy, geoloc-debug, geoloc-keep, geoloc-status, gps-fixes, last-fix, date-last-fix, geoloc-debug-log
19:19:58     INFO -  /build_stage/geoloc/index.html: [l10n] [sr-Latn]: 17 missing compared to en-US: geolocation-tracker, geoloc-start, geoloc-stop, geoloc-clear, geoloc-debug, geoloc-keep, geoloc-save, geoloc-parameters, geoloc-status, geoloc-debug-log, geoloc-timeout, geoloc-maxage, geoloc-highaccuracy, geoloc-msecs, gps-fixes, last-fix, date-last-fix
19:19:58     INFO -  /builds/slave/b2g_m-in_emu-jb_dep-0000000000/build/gaia/build_stage/geoloc/locales/geoloc.sv-SE.properties could not be found.
19:19:58     INFO -  /build_stage/geoloc/index.html: [l10n] [sv-SE]: 17 missing in the visible DOM: geolocation-tracker, geoloc-start, geoloc-stop, geoloc-clear, geoloc-save, geoloc-parameters, geoloc-timeout, geoloc-maxage, geoloc-msecs, geoloc-highaccuracy, geoloc-debug, geoloc-keep, geoloc-status, gps-fixes, last-fix, date-last-fix, geoloc-debug-log
19:19:58     INFO -  /build_stage/geoloc/index.html: [l10n] [sv-SE]: 17 missing compared to en-US: geolocation-tracker, geoloc-start, geoloc-stop, geoloc-clear, geoloc-debug, geoloc-keep, geoloc-save, geoloc-parameters, geoloc-status, geoloc-debug-log, geoloc-timeout, geoloc-maxage, geoloc-highaccuracy, geoloc-msecs, gps-fixes, last-fix, date-last-fix
19:19:58     INFO -  /builds/slave/b2g_m-in_emu-jb_dep-0000000000/build/gaia/build_stage/geoloc/locales/geoloc.tr.properties could not be found.
19:19:58     INFO -  /build_stage/geoloc/index.html: [l10n] [tr]: 17 missing in the visible DOM: geolocation-tracker, geoloc-start, geoloc-stop, geoloc-clear, geoloc-save, geoloc-parameters, geoloc-timeout, geoloc-maxage, geoloc-msecs, geoloc-highaccuracy, geoloc-debug, geoloc-keep, geoloc-status, gps-fixes, last-fix, date-last-fix, geoloc-debug-log
19:19:58     INFO -  /build_stage/geoloc/index.html: [l10n] [tr]: 17 missing compared to en-US: geolocation-tracker, geoloc-start, geoloc-stop, geoloc-clear, geoloc-debug, geoloc-keep, geoloc-save, geoloc-parameters, geoloc-status, geoloc-debug-log, geoloc-timeout, geoloc-maxage, geoloc-highaccuracy, geoloc-msecs, gps-fixes, last-fix, date-last-fix
19:19:58     INFO -  /builds/slave/b2g_m-in_emu-jb_dep-0000000000/build/gaia/build_stage/geoloc/locales/geoloc.zh-CN.properties could not be found.
19:19:58     INFO -  /build_stage/geoloc/index.html: [l10n] [zh-CN]: 17 missing in the visible DOM: geolocation-tracker, geoloc-start, geoloc-stop, geoloc-clear, geoloc-save, geoloc-parameters, geoloc-timeout, geoloc-maxage, geoloc-msecs, geoloc-highaccuracy, geoloc-debug, geoloc-keep, geoloc-status, gps-fixes, last-fix, date-last-fix, geoloc-debug-log
19:19:58     INFO -  /build_stage/geoloc/index.html: [l10n] [zh-CN]: 17 missing compared to en-US: geolocation-tracker, geoloc-start, geoloc-stop, geoloc-clear, geoloc-debug, geoloc-keep, geoloc-save, geoloc-parameters, geoloc-status, geoloc-debug-log, geoloc-timeout, geoloc-maxage, geoloc-highaccuracy, geoloc-msecs, gps-fixes, last-fix, date-last-fix
19:19:58     INFO -  [optimize] aggregating javascript for : "geoloc"
19:20:08     INFO -  # create a clean folder to store data for B2G, this folder will copy to b2g output folder.
19:20:08     INFO -  rm -rf profile/defaults
19:20:08     INFO -  mkdir -p profile/defaults/pref
19:20:08     INFO -  # rename user_pref() to pref() in user.js
19:20:08     INFO -  sed s/user_pref\(/pref\(/ profile/user.js > profile/defaults/pref/user.js
19:20:08     INFO -  cp profile/settings.json profile/defaults/settings.json
19:20:08     INFO -  Profile Ready: please run [b2g|firefox] -profile /builds/slave/b2g_m-in_emu-jb_dep-0000000000/build/gaia/profile
19:20:08     INFO -  make[1]: Leaving directory `/builds/slave/b2g_m-in_emu-jb_dep-0000000000/build/gaia'
19:20:10     INFO -  real	1m56.529s
19:20:10     INFO -  user	2m21.081s
19:20:10     INFO -  sys	0m15.828s
19:20:10     INFO -  
19:20:10     INFO -  > Build failed! <
19:20:10     INFO -  Build with |./build.sh -j1| for better messages
19:20:10     INFO -  If all else fails, use |rm -rf objdir-gecko| to clobber gecko and |rm -rf out| to clobber everything else.
19:20:10    ERROR - Return code: 2
19:20:10     INFO - Running command: ['mock_mozilla', '-r', u'mozilla-centos6-x86_64', '-q', '--cwd', '/builds/slave/b2g_m-in_emu-jb_dep-0000000000/build', '--unpriv', '--shell', u'/usr/bin/env MOZ_AUTOMATION=1 GAIA_OPTIMIZE=1 "LESSOPEN=|/usr/bin/lesspipe.sh %s" TMOUT=86400 CVS_RSH=ssh LOGNAME=cltbld USER=cltbld PATH=/tools/python27/bin:/usr/local/bin:/usr/lib64/ccache:/usr/local/bin:/bin:/usr/bin:/usr/local/sbin:/usr/sbin:/sbin:/home/cltbld/bin:/builds/slave/b2g_m-in_emu-jb_dep-0000000000/build/compare-locales/scripts SYMBOL_SERVER_USER=b2gbld "WGET_OPTS=-c -q" CCACHE_UMASK=002 LANG=en_US.UTF-8 CCACHE_HASHDIR= TERM=linux SHELL=/bin/bash MOZ_BUILD_DATE=20140625191205 SHLVL=1 G_BROKEN_FILENAMES=1 HISTSIZE=1000 SYMBOL_SERVER_PATH=/mnt/netapp/breakpad/symbols_b2g/ LOCALES_FILE=/builds/slave/b2g_m-in_emu-jb_dep-0000000000/build/gaia/locales/languages_dev.json SYMBOL_SERVER_HOST=symbolpush.mozilla.org CCACHE_DIR=/builds/ccache PYTHONPATH=:/builds/slave/b2g_m-in_emu-jb_dep-0000000000/build/compare-locales/lib L10NBASEDIR=/builds/slave/b2g_m-in_emu-jb_dep-0000000000/build/gecko-l10n TINDERBOX_OUTPUT=1 "MOZ_CHROME_MULTILOCALE=es-ES pl pt-BR" MAIL=/var/spool/mail/cltbld CCACHE_COMPRESS=1 _=/tools/buildbot/bin/python CCACHE_BASEDIR=/builds/slave/b2g_m-in_emu-jb_dep-0000000000/build HOSTNAME=bld-linux64-spot-108.build.releng.use1.mozilla.com SYMBOL_SERVER_SSH_KEY=/home/mock_mozilla/.ssh/b2gbld_dsa LOCALE_BASEDIR=/builds/slave/b2g_m-in_emu-jb_dep-0000000000/build/gaia-l10n HISTCONTROL=ignoredups POST_SYMBOL_UPLOAD_CMD=/usr/local/bin/post-symbol-upload.py PWD=/builds/slave/b2g_m-in_emu-jb_dep-0000000000 PROPERTIES_FILE=/builds/slave/b2g_m-in_emu-jb_dep-0000000000/buildprops.json MOZ_CRASHREPORTER_NO_REPORT=1 B2G_UPDATER=1 B2G_UPDATE_CHANNEL=emulator-jb/default/default ccache -s'] in /builds/slave/b2g_m-in_emu-jb_dep-0000000000/build
19:20:10     INFO - Copy/paste: mock_mozilla -r mozilla-centos6-x86_64 -q --cwd /builds/slave/b2g_m-in_emu-jb_dep-0000000000/build --unpriv --shell "/usr/bin/env MOZ_AUTOMATION=1 GAIA_OPTIMIZE=1 \"LESSOPEN=|/usr/bin/lesspipe.sh %s\" TMOUT=86400 CVS_RSH=ssh LOGNAME=cltbld USER=cltbld PATH=/tools/python27/bin:/usr/local/bin:/usr/lib64/ccache:/usr/local/bin:/bin:/usr/bin:/usr/local/sbin:/usr/sbin:/sbin:/home/cltbld/bin:/builds/slave/b2g_m-in_emu-jb_dep-0000000000/build/compare-locales/scripts SYMBOL_SERVER_USER=b2gbld \"WGET_OPTS=-c -q\" CCACHE_UMASK=002 LANG=en_US.UTF-8 CCACHE_HASHDIR= TERM=linux SHELL=/bin/bash MOZ_BUILD_DATE=20140625191205 SHLVL=1 G_BROKEN_FILENAMES=1 HISTSIZE=1000 SYMBOL_SERVER_PATH=/mnt/netapp/breakpad/symbols_b2g/ LOCALES_FILE=/builds/slave/b2g_m-in_emu-jb_dep-0000000000/build/gaia/locales/languages_dev.json SYMBOL_SERVER_HOST=symbolpush.mozilla.org CCACHE_DIR=/builds/ccache PYTHONPATH=:/builds/slave/b2g_m-in_emu-jb_dep-0000000000/build/compare-locales/lib L10NBASEDIR=/builds/slave/b2g_m-in_emu-jb_dep-0000000000/build/gecko-l10n TINDERBOX_OUTPUT=1 \"MOZ_CHROME_MULTILOCALE=es-ES pl pt-BR\" MAIL=/var/spool/mail/cltbld CCACHE_COMPRESS=1 _=/tools/buildbot/bin/python CCACHE_BASEDIR=/builds/slave/b2g_m-in_emu-jb_dep-0000000000/build HOSTNAME=bld-linux64-spot-108.build.releng.use1.mozilla.com SYMBOL_SERVER_SSH_KEY=/home/mock_mozilla/.ssh/b2gbld_dsa LOCALE_BASEDIR=/builds/slave/b2g_m-in_emu-jb_dep-0000000000/build/gaia-l10n HISTCONTROL=ignoredups POST_SYMBOL_UPLOAD_CMD=/usr/local/bin/post-symbol-upload.py PWD=/builds/slave/b2g_m-in_emu-jb_dep-0000000000 PROPERTIES_FILE=/builds/slave/b2g_m-in_emu-jb_dep-0000000000/buildprops.json MOZ_CRASHREPORTER_NO_REPORT=1 B2G_UPDATER=1 B2G_UPDATE_CHANNEL=emulator-jb/default/default ccache -s"
19:20:10     INFO -  cache directory                     /builds/ccache
19:20:10     INFO -  cache hit (direct)                     1
19:20:10     INFO -  cache hit (preprocessed)               0
19:20:10     INFO -  cache miss                             1
19:20:10     INFO -  called for preprocessing               2
19:20:10     INFO -  files in cache                         2
19:20:10     INFO -  cache size                             8 Kbytes
19:20:10     INFO -  max cache size                       1.0 Gbytes
19:20:10     INFO - Return code: 0
19:20:10    FATAL - failed to build
19:20:10    FATAL - Running post_fatal callback...
19:20:10    FATAL - Exiting 2
(Assignee)

Comment 1

4 years ago
Ha, that's a regression from bug 1028563.
(Assignee)

Updated

4 years ago
Blocks: 1028563
(Assignee)

Comment 2

4 years ago
Created attachment 8446365 [details] [diff] [review]
Fix make export race condition after bug 1028563
Attachment #8446365 - Flags: review?(gps)
(Assignee)

Updated

4 years ago
Assignee: nobody → mh+mozilla
Status: NEW → ASSIGNED

Updated

4 years ago
Attachment #8446365 - Flags: review?(gps) → review+
https://hg.mozilla.org/mozilla-central/rev/29bbf1aba13a
Status: ASSIGNED → RESOLVED
Last Resolved: 4 years ago
Resolution: --- → FIXED
Target Milestone: --- → mozilla33
status-firefox31: --- → unaffected
status-firefox32: --- → unaffected
status-firefox33: --- → fixed
status-firefox-esr24: --- → unaffected

Updated

8 months ago
Product: Core → Firefox Build System
You need to log in before you can comment on or make changes to this bug.