Closed Bug 1053913 Opened 8 years ago Closed 8 years ago

TEST-UNEXPECTED-FAIL | e10s/main.testTabIsRemote | Test timed out

Categories

(Add-on SDK Graveyard :: General, defect)

All
Linux
defect
Not set
normal

Tracking

(e10s+)

RESOLVED DUPLICATE of bug 1054482
Tracking Status
e10s + ---

People

(Reporter: evold, Unassigned)

References

(Blocks 1 open bug, )

Details

console.info: e10s: hiddenWindow document.documentURI:resource://gre-resources/hiddenWindow.html
console.info: e10s: hiddenWindow document.readyState:complete
Running tests on Firefox 34.0a1/Gecko 34.0a1 ({ec8030f7-c20a-464f-9b0e-13a3a9e97384}) under linux/x86.
TEST-START | e10s/main.testTabIsRemote
TEST-INFO | [JavaScript Error: "Error adding value null to histogram PLACES_ANNOS_PAGES_SIZE_KB: Error: Not a number" {file: "resource://gre/modules/PlacesDBUtils.jsm" line: 1018}]
TEST-UNEXPECTED-FAIL | e10s/main.testTabIsRemote | Test timed out
TEST-INFO | Traceback (most recent call last):
  File "resource://extensions.modules.jid1-dyaxfhaplhwbgw-at-jetpack.commonjs.path/sdk/timers.js", line 40, in notify
    callback.apply(null, args);
  File "resource://extensions.modules.jid1-dyaxfhaplhwbgw-at-jetpack.commonjs.path/sdk/test/runner.js", line 36, in runTests/<
    require("../timers").setTimeout(_ => harness.runTests({
  File "resource://extensions.modules.jid1-dyaxfhaplhwbgw-at-jetpack.commonjs.path/sdk/test/harness.js", line 597, in runTests
    nextIteration();
  File "resource://extensions.modules.jid1-dyaxfhaplhwbgw-at-jetpack.commonjs.path/sdk/test/harness.js", line 410, in nextIteration
    checkForEnd();
  File "resource://extensions.modules.jid1-dyaxfhaplhwbgw-at-jetpack.commonjs.path/sdk/test/harness.js", line 419, in checkForEnd
    findAndRunTests(loader, nextIteration);
  File "resource://extensions.modules.jid1-dyaxfhaplhwbgw-at-jetpack.commonjs.path/sdk/test/runner.js", line 117, in findAndRunTests
    runner.startMany({
  File "resource://extensions.modules.jid1-dyaxfhaplhwbgw-at-jetpack.commonjs.path/sdk/deprecated/unit-test.js", line 496, in startMany
    runNextTest(this);
  File "resource://extensions.modules.jid1-dyaxfhaplhwbgw-at-jetpack.commonjs.path/sdk/deprecated/unit-test.js", line 491, in runNextTest
    self.start({test: test, onDone: runNextTest});
  File "resource://extensions.modules.jid1-dyaxfhaplhwbgw-at-jetpack.commonjs.path/sdk/deprecated/unit-test.js", line 524, in start
    this.test.testFunction(this);
  File "resource://extensions.modules.jid1-dyaxfhaplhwbgw-at-jetpack.commonjs.path/sdk/test.js", line 68, in null
    test(assert, function() {
  File "resource://jid1-dyaxfhaplhwbgw-at-jetpack/e10s/lib/main.js", line 44, in makeE10sTests/newExports[key]
    openE10sWindow().then(window => {
  File "resource://jid1-dyaxfhaplhwbgw-at-jetpack/e10s/lib/main.js", line 33, in openE10sWindow
    let window = getMostRecentBrowserWindow().OpenBrowserWindow({ remote: true });
  File "chrome://browser/content/browser.js", line 12961, in OpenBrowserWindow
    alert("To use out-of-process tabs, you must set the layers.offmainthreadcomposition.enabled preference and restart. Opening a normal window instead.");
  File "resource://gre/components/nsPrompter.js", line 604, in ModalPrompter.prototype.alert
    this.openPrompt(args);
  File "resource://gre/components/nsPrompter.js", line 552, in ModalPrompter.prototype.openPrompt
    openModalWindow(this.domWin, uri, propBag);
  File "resource://gre/components/nsPrompter.js", line 369, in openModalWindow
    Services.ww.openWindow(domWin, uri, "_blank", "centerscreen,chrome,modal,titlebar", args);
  File "resource://extensions.modules.jid1-dyaxfhaplhwbgw-at-jetpack.commonjs.path/sdk/timers.js", line 40, in notify
    callback.apply(null, args);
  File "resource://extensions.modules.jid1-dyaxfhaplhwbgw-at-jetpack.commonjs.path/sdk/deprecated/unit-test.js", line 463, in tiredOfWaiting
    self.console.testMessage(false, false, self.test.name, "Test timed out");
  File "resource://extensions.modules.jid1-dyaxfhaplhwbgw-at-jetpack.commonjs.path/sdk/test/harness.js", line 527, in testMessage
    this.trace();
TEST-UNEXPECTED-FAIL | e10s/main.testTabIsRemote | Should not be any unexpected windows open
TEST-INFO | Traceback (most recent call last):
  File "resource://extensions.modules.jid1-dyaxfhaplhwbgw-at-jetpack.commonjs.path/sdk/timers.js", line 40, in notify
    callback.apply(null, args);
  File "resource://extensions.modules.jid1-dyaxfhaplhwbgw-at-jetpack.commonjs.path/sdk/test/runner.js", line 36, in runTests/<
    require("../timers").setTimeout(_ => harness.runTests({
  File "resource://extensions.modules.jid1-dyaxfhaplhwbgw-at-jetpack.commonjs.path/sdk/test/harness.js", line 597, in runTests
    nextIteration();
  File "resource://extensions.modules.jid1-dyaxfhaplhwbgw-at-jetpack.commonjs.path/sdk/test/harness.js", line 410, in nextIteration
    checkForEnd();
  File "resource://extensions.modules.jid1-dyaxfhaplhwbgw-at-jetpack.commonjs.path/sdk/test/harness.js", line 419, in checkForEnd
    findAndRunTests(loader, nextIteration);
  File "resource://extensions.modules.jid1-dyaxfhaplhwbgw-at-jetpack.commonjs.path/sdk/test/runner.js", line 117, in findAndRunTests
    runner.startMany({
  File "resource://extensions.modules.jid1-dyaxfhaplhwbgw-at-jetpack.commonjs.path/sdk/deprecated/unit-test.js", line 496, in startMany
    runNextTest(this);
  File "resource://extensions.modules.jid1-dyaxfhaplhwbgw-at-jetpack.commonjs.path/sdk/deprecated/unit-test.js", line 491, in runNextTest
    self.start({test: test, onDone: runNextTest});
  File "resource://extensions.modules.jid1-dyaxfhaplhwbgw-at-jetpack.commonjs.path/sdk/deprecated/unit-test.js", line 524, in start
    this.test.testFunction(this);
  File "resource://extensions.modules.jid1-dyaxfhaplhwbgw-at-jetpack.commonjs.path/sdk/test.js", line 68, in null
    test(assert, function() {
  File "resource://jid1-dyaxfhaplhwbgw-at-jetpack/e10s/lib/main.js", line 44, in makeE10sTests/newExports[key]
    openE10sWindow().then(window => {
  File "resource://jid1-dyaxfhaplhwbgw-at-jetpack/e10s/lib/main.js", line 33, in openE10sWindow
    let window = getMostRecentBrowserWindow().OpenBrowserWindow({ remote: true });
  File "chrome://browser/content/browser.js", line 12961, in OpenBrowserWindow
    alert("To use out-of-process tabs, you must set the layers.offmainthreadcomposition.enabled preference and restart. Opening a normal window instead.");
  File "resource://gre/components/nsPrompter.js", line 604, in ModalPrompter.prototype.alert
    this.openPrompt(args);
  File "resource://gre/components/nsPrompter.js", line 552, in ModalPrompter.prototype.openPrompt
    openModalWindow(this.domWin, uri, propBag);
  File "resource://gre/components/nsPrompter.js", line 369, in openModalWindow
    Services.ww.openWindow(domWin, uri, "_blank", "centerscreen,chrome,modal,titlebar", args);
  File "resource://gre/modules/Promise-backend.js", line 745, in this.PromiseWalker.walkerLoop
    this.handlers.shift().process();
  File "resource://gre/modules/Promise-backend.js", line 866, in Handler.prototype.process
    nextValue = this.onResolve.call(undefined, nextValue);
  File "resource://extensions.modules.jid1-dyaxfhaplhwbgw-at-jetpack.commonjs.path/sdk/deprecated/unit-test.js", line 318, in done/<
    this.fail("Should not be any unexpected windows open");
  File "resource://extensions.modules.jid1-dyaxfhaplhwbgw-at-jetpack.commonjs.path/sdk/deprecated/unit-test.js", line 92, in fail
    this.console.testMessage(false, false, this.test.name, message);
  File "resource://extensions.modules.jid1-dyaxfhaplhwbgw-at-jetpack.commonjs.path/sdk/test/harness.js", line 527, in testMessage
    this.trace();
TEST-INFO | Windows open:
TEST-INFO | chrome://browser/content/browser.xul - about:blank
TEST-INFO | chrome://global/content/commonDialog.xul
TEST-END | e10s/main.testTabIsRemote

0 of 2 tests passed.

The following tests failed:
  e10s/main.testTabIsRemote: timed out, failure

Total time: 305.217007 seconds
Program terminated unsuccessfully.
Testing e10s-tabs...
Using binary at '/builds/slave/test/addonsdk-poller/firefox/firefox'.
Using profile at '/tmp/tmp8WWtjM.mozrunner'.
Xlib:  extension "RANDR" missing on display ":0".
console.info: e10s-tabs: hiddenWindow document.documentURI:resource://gre-resources/hiddenWindow.html
console.info: e10s-tabs: hiddenWindow document.readyState:complete
Running tests on Firefox 34.0a1/Gecko 34.0a1 ({ec8030f7-c20a-464f-9b0e-13a3a9e97384}) under linux/x86.
TEST-START | e10s-tabs/main.test GetTabForWindow
TEST-INFO | [JavaScript Error: "Error adding value null to histogram PLACES_ANNOS_PAGES_SIZE_KB: Error: Not a number" {file: "resource://gre/modules/PlacesDBUtils.jsm" line: 1018}]
TEST-UNEXPECTED-FAIL | e10s-tabs/main.test GetTabForWindow | Test timed out
TEST-INFO | Traceback (most recent call last):
  File "resource://extensions.modules.jid1-zzaxfhaplhwbgw-at-jetpack.commonjs.path/sdk/timers.js", line 40, in notify
    callback.apply(null, args);
  File "resource://extensions.modules.jid1-zzaxfhaplhwbgw-at-jetpack.commonjs.path/sdk/test/runner.js", line 36, in runTests/<
    require("../timers").setTimeout(_ => harness.runTests({
  File "resource://extensions.modules.jid1-zzaxfhaplhwbgw-at-jetpack.commonjs.path/sdk/test/harness.js", line 597, in runTests
    nextIteration();
  File "resource://extensions.modules.jid1-zzaxfhaplhwbgw-at-jetpack.commonjs.path/sdk/test/harness.js", line 410, in nextIteration
    checkForEnd();
  File "resource://extensions.modules.jid1-zzaxfhaplhwbgw-at-jetpack.commonjs.path/sdk/test/harness.js", line 419, in checkForEnd
    findAndRunTests(loader, nextIteration);
  File "resource://extensions.modules.jid1-zzaxfhaplhwbgw-at-jetpack.commonjs.path/sdk/test/runner.js", line 117, in findAndRunTests
    runner.startMany({
  File "resource://extensions.modules.jid1-zzaxfhaplhwbgw-at-jetpack.commonjs.path/sdk/deprecated/unit-test.js", line 496, in startMany
    runNextTest(this);
  File "resource://extensions.modules.jid1-zzaxfhaplhwbgw-at-jetpack.commonjs.path/sdk/deprecated/unit-test.js", line 491, in runNextTest
    self.start({test: test, onDone: runNextTest});
  File "resource://extensions.modules.jid1-zzaxfhaplhwbgw-at-jetpack.commonjs.path/sdk/deprecated/unit-test.js", line 524, in start
    this.test.testFunction(this);
  File "resource://extensions.modules.jid1-zzaxfhaplhwbgw-at-jetpack.commonjs.path/sdk/test.js", line 68, in null
    test(assert, function() {
  File "resource://jid1-zzaxfhaplhwbgw-at-jetpack/e10s-tabs/lib/main.js", line 28, in makeE10sTests/newExports[key]
    openE10sWindow().then(window => {
  File "resource://jid1-zzaxfhaplhwbgw-at-jetpack/e10s-tabs/lib/main.js", line 17, in openE10sWindow
    let window = getMostRecentBrowserWindow().OpenBrowserWindow({ remote: true });
  File "chrome://browser/content/browser.js", line 12961, in OpenBrowserWindow
    alert("To use out-of-process tabs, you must set the layers.offmainthreadcomposition.enabled preference and restart. Opening a normal window instead.");
  File "resource://gre/components/nsPrompter.js", line 604, in ModalPrompter.prototype.alert
    this.openPrompt(args);
  File "resource://gre/components/nsPrompter.js", line 552, in ModalPrompter.prototype.openPrompt
    openModalWindow(this.domWin, uri, propBag);
  File "resource://gre/components/nsPrompter.js", line 369, in openModalWindow
    Services.ww.openWindow(domWin, uri, "_blank", "centerscreen,chrome,modal,titlebar", args);
  File "resource://extensions.modules.jid1-zzaxfhaplhwbgw-at-jetpack.commonjs.path/sdk/timers.js", line 40, in notify
    callback.apply(null, args);
  File "resource://extensions.modules.jid1-zzaxfhaplhwbgw-at-jetpack.commonjs.path/sdk/deprecated/unit-test.js", line 463, in tiredOfWaiting
    self.console.testMessage(false, false, self.test.name, "Test timed out");
  File "resource://extensions.modules.jid1-zzaxfhaplhwbgw-at-jetpack.commonjs.path/sdk/test/harness.js", line 527, in testMessage
    this.trace();
TEST-UNEXPECTED-FAIL | e10s-tabs/main.test GetTabForWindow | Should not be any unexpected windows open
TEST-INFO | Traceback (most recent call last):
  File "resource://extensions.modules.jid1-zzaxfhaplhwbgw-at-jetpack.commonjs.path/sdk/timers.js", line 40, in notify
    callback.apply(null, args);
  File "resource://extensions.modules.jid1-zzaxfhaplhwbgw-at-jetpack.commonjs.path/sdk/test/runner.js", line 36, in runTests/<
    require("../timers").setTimeout(_ => harness.runTests({
  File "resource://extensions.modules.jid1-zzaxfhaplhwbgw-at-jetpack.commonjs.path/sdk/test/harness.js", line 597, in runTests
    nextIteration();
  File "resource://extensions.modules.jid1-zzaxfhaplhwbgw-at-jetpack.commonjs.path/sdk/test/harness.js", line 410, in nextIteration
    checkForEnd();
  File "resource://extensions.modules.jid1-zzaxfhaplhwbgw-at-jetpack.commonjs.path/sdk/test/harness.js", line 419, in checkForEnd
    findAndRunTests(loader, nextIteration);
  File "resource://extensions.modules.jid1-zzaxfhaplhwbgw-at-jetpack.commonjs.path/sdk/test/runner.js", line 117, in findAndRunTests
    runner.startMany({
  File "resource://extensions.modules.jid1-zzaxfhaplhwbgw-at-jetpack.commonjs.path/sdk/deprecated/unit-test.js", line 496, in startMany
    runNextTest(this);
  File "resource://extensions.modules.jid1-zzaxfhaplhwbgw-at-jetpack.commonjs.path/sdk/deprecated/unit-test.js", line 491, in runNextTest
    self.start({test: test, onDone: runNextTest});
  File "resource://extensions.modules.jid1-zzaxfhaplhwbgw-at-jetpack.commonjs.path/sdk/deprecated/unit-test.js", line 524, in start
    this.test.testFunction(this);
  File "resource://extensions.modules.jid1-zzaxfhaplhwbgw-at-jetpack.commonjs.path/sdk/test.js", line 68, in null
    test(assert, function() {
  File "resource://jid1-zzaxfhaplhwbgw-at-jetpack/e10s-tabs/lib/main.js", line 28, in makeE10sTests/newExports[key]
    openE10sWindow().then(window => {
  File "resource://jid1-zzaxfhaplhwbgw-at-jetpack/e10s-tabs/lib/main.js", line 17, in openE10sWindow
    let window = getMostRecentBrowserWindow().OpenBrowserWindow({ remote: true });
  File "chrome://browser/content/browser.js", line 12961, in OpenBrowserWindow
    alert("To use out-of-process tabs, you must set the layers.offmainthreadcomposition.enabled preference and restart. Opening a normal window instead.");
  File "resource://gre/components/nsPrompter.js", line 604, in ModalPrompter.prototype.alert
    this.openPrompt(args);
  File "resource://gre/components/nsPrompter.js", line 552, in ModalPrompter.prototype.openPrompt
    openModalWindow(this.domWin, uri, propBag);
  File "resource://gre/components/nsPrompter.js", line 369, in openModalWindow
    Services.ww.openWindow(domWin, uri, "_blank", "centerscreen,chrome,modal,titlebar", args);
  File "resource://gre/modules/Promise-backend.js", line 745, in this.PromiseWalker.walkerLoop
    this.handlers.shift().process();
  File "resource://gre/modules/Promise-backend.js", line 866, in Handler.prototype.process
    nextValue = this.onResolve.call(undefined, nextValue);
  File "resource://extensions.modules.jid1-zzaxfhaplhwbgw-at-jetpack.commonjs.path/sdk/deprecated/unit-test.js", line 318, in done/<
    this.fail("Should not be any unexpected windows open");
  File "resource://extensions.modules.jid1-zzaxfhaplhwbgw-at-jetpack.commonjs.path/sdk/deprecated/unit-test.js", line 92, in fail
    this.console.testMessage(false, false, this.test.name, message);
  File "resource://extensions.modules.jid1-zzaxfhaplhwbgw-at-jetpack.commonjs.path/sdk/test/harness.js", line 527, in testMessage
    this.trace();
TEST-INFO | Windows open:
TEST-INFO | chrome://browser/content/browser.xul - about:blank
TEST-INFO | chrome://global/content/commonDialog.xul
TEST-END | e10s-tabs/main.test GetTabForWindow
TEST-START | e10s-tabs/main.test behavior on close
TEST-UNEXPECTED-FAIL | e10s-tabs/main.test behavior on close | Test timed out
TEST-INFO | Traceback (most recent call last):
  File "resource://extensions.modules.jid1-zzaxfhaplhwbgw-at-jetpack.commonjs.path/sdk/timers.js", line 40, in notify
    callback.apply(null, args);
  File "resource://extensions.modules.jid1-zzaxfhaplhwbgw-at-jetpack.commonjs.path/sdk/test/runner.js", line 36, in runTests/<
    require("../timers").setTimeout(_ => harness.runTests({
  File "resource://extensions.modules.jid1-zzaxfhaplhwbgw-at-jetpack.commonjs.path/sdk/test/harness.js", line 597, in runTests
    nextIteration();
  File "resource://extensions.modules.jid1-zzaxfhaplhwbgw-at-jetpack.commonjs.path/sdk/test/harness.js", line 410, in nextIteration
    checkForEnd();
  File "resource://extensions.modules.jid1-zzaxfhaplhwbgw-at-jetpack.commonjs.path/sdk/test/harness.js", line 419, in checkForEnd
    findAndRunTests(loader, nextIteration);
  File "resource://extensions.modules.jid1-zzaxfhaplhwbgw-at-jetpack.commonjs.path/sdk/test/runner.js", line 117, in findAndRunTests
    runner.startMany({
  File "resource://extensions.modules.jid1-zzaxfhaplhwbgw-at-jetpack.commonjs.path/sdk/deprecated/unit-test.js", line 496, in startMany
    runNextTest(this);
  File "resource://extensions.modules.jid1-zzaxfhaplhwbgw-at-jetpack.commonjs.path/sdk/deprecated/unit-test.js", line 491, in runNextTest
    self.start({test: test, onDone: runNextTest});
  File "resource://extensions.modules.jid1-zzaxfhaplhwbgw-at-jetpack.commonjs.path/sdk/deprecated/unit-test.js", line 524, in start
    this.test.testFunction(this);
  File "resource://extensions.modules.jid1-zzaxfhaplhwbgw-at-jetpack.commonjs.path/sdk/test.js", line 68, in null
    test(assert, function() {
  File "resource://jid1-zzaxfhaplhwbgw-at-jetpack/e10s-tabs/lib/main.js", line 28, in makeE10sTests/newExports[key]
    openE10sWindow().then(window => {
  File "resource://jid1-zzaxfhaplhwbgw-at-jetpack/e10s-tabs/lib/main.js", line 17, in openE10sWindow
    let window = getMostRecentBrowserWindow().OpenBrowserWindow({ remote: true });
  File "chrome://browser/content/browser.js", line 12961, in OpenBrowserWindow
    alert("To use out-of-process tabs, you must set the layers.offmainthreadcomposition.enabled preference and restart. Opening a normal window instead.");
  File "resource://gre/components/nsPrompter.js", line 604, in ModalPrompter.prototype.alert
    this.openPrompt(args);
  File "resource://gre/components/nsPrompter.js", line 552, in ModalPrompter.prototype.openPrompt
    openModalWindow(this.domWin, uri, propBag);
  File "resource://gre/components/nsPrompter.js", line 369, in openModalWindow
    Services.ww.openWindow(domWin, uri, "_blank", "centerscreen,chrome,modal,titlebar", args);
  File "resource://extensions.modules.jid1-zzaxfhaplhwbgw-at-jetpack.commonjs.path/sdk/timers.js", line 40, in notify
    callback.apply(null, args);
  File "resource://extensions.modules.jid1-zzaxfhaplhwbgw-at-jetpack.commonjs.path/sdk/deprecated/unit-test.js", line 346, in done/</<
    timer.setTimeout(_ => onDone(this), 0);
  File "resource://extensions.modules.jid1-zzaxfhaplhwbgw-at-jetpack.commonjs.path/sdk/deprecated/unit-test.js", line 511, in start/this.onDone
    options.onDone(self);
  File "resource://extensions.modules.jid1-zzaxfhaplhwbgw-at-jetpack.commonjs.path/sdk/deprecated/unit-test.js", line 491, in runNextTest
    self.start({test: test, onDone: runNextTest});
  File "resource://extensions.modules.jid1-zzaxfhaplhwbgw-at-jetpack.commonjs.path/sdk/deprecated/unit-test.js", line 524, in start
    this.test.testFunction(this);
  File "resource://extensions.modules.jid1-zzaxfhaplhwbgw-at-jetpack.commonjs.path/sdk/test.js", line 68, in null
    test(assert, function() {
  File "resource://jid1-zzaxfhaplhwbgw-at-jetpack/e10s-tabs/lib/main.js", line 28, in makeE10sTests/newExports[key]
    openE10sWindow().then(window => {
  File "resource://jid1-zzaxfhaplhwbgw-at-jetpack/e10s-tabs/lib/main.js", line 17, in openE10sWindow
    let window = getMostRecentBrowserWindow().OpenBrowserWindow({ remote: true });
  File "chrome://browser/content/browser.js", line 12961, in OpenBrowserWindow
    alert("To use out-of-process tabs, you must set the layers.offmainthreadcomposition.enabled preference and restart. Opening a normal window instead.");
  File "resource://gre/components/nsPrompter.js", line 604, in ModalPrompter.prototype.alert
    this.openPrompt(args);
  File "resource://gre/components/nsPrompter.js", line 552, in ModalPrompter.prototype.openPrompt
    openModalWindow(this.domWin, uri, propBag);
  File "resource://gre/components/nsPrompter.js", line 369, in openModalWindow
    Services.ww.openWindow(domWin, uri, "_blank", "centerscreen,chrome,modal,titlebar", args);
  File "resource://extensions.modules.jid1-zzaxfhaplhwbgw-at-jetpack.commonjs.path/sdk/timers.js", line 40, in notify
    callback.apply(null, args);
  File "resource://extensions.modules.jid1-zzaxfhaplhwbgw-at-jetpack.commonjs.path/sdk/deprecated/unit-test.js", line 463, in tiredOfWaiting
    self.console.testMessage(false, false, self.test.name, "Test timed out");
  File "resource://extensions.modules.jid1-zzaxfhaplhwbgw-at-jetpack.commonjs.path/sdk/test/harness.js", line 527, in testMessage
    this.trace();
TEST-UNEXPECTED-FAIL | e10s-tabs/main.test behavior on close | Should not be any unexpected windows open
TEST-INFO | Traceback (most recent call last):
  File "resource://extensions.modules.jid1-zzaxfhaplhwbgw-at-jetpack.commonjs.path/sdk/timers.js", line 40, in notify
    callback.apply(null, args);
  File "resource://extensions.modules.jid1-zzaxfhaplhwbgw-at-jetpack.commonjs.path/sdk/test/runner.js", line 36, in runTests/<
    require("../timers").setTimeout(_ => harness.runTests({
  File "resource://extensions.modules.jid1-zzaxfhaplhwbgw-at-jetpack.commonjs.path/sdk/test/harness.js", line 597, in runTests
    nextIteration();
  File "resource://extensions.modules.jid1-zzaxfhaplhwbgw-at-jetpack.commonjs.path/sdk/test/harness.js", line 410, in nextIteration
    checkForEnd();
  File "resource://extensions.modules.jid1-zzaxfhaplhwbgw-at-jetpack.commonjs.path/sdk/test/harness.js", line 419, in checkForEnd
    findAndRunTests(loader, nextIteration);
  File "resource://extensions.modules.jid1-zzaxfhaplhwbgw-at-jetpack.commonjs.path/sdk/test/runner.js", line 117, in findAndRunTests
    runner.startMany({
  File "resource://extensions.modules.jid1-zzaxfhaplhwbgw-at-jetpack.commonjs.path/sdk/deprecated/unit-test.js", line 496, in startMany
    runNextTest(this);
  File "resource://extensions.modules.jid1-zzaxfhaplhwbgw-at-jetpack.commonjs.path/sdk/deprecated/unit-test.js", line 491, in runNextTest
    self.start({test: test, onDone: runNextTest});
  File "resource://extensions.modules.jid1-zzaxfhaplhwbgw-at-jetpack.commonjs.path/sdk/deprecated/unit-test.js", line 524, in start
    this.test.testFunction(this);
  File "resource://extensions.modules.jid1-zzaxfhaplhwbgw-at-jetpack.commonjs.path/sdk/test.js", line 68, in null
    test(assert, function() {
  File "resource://jid1-zzaxfhaplhwbgw-at-jetpack/e10s-tabs/lib/main.js", line 28, in makeE10sTests/newExports[key]
    openE10sWindow().then(window => {
  File "resource://jid1-zzaxfhaplhwbgw-at-jetpack/e10s-tabs/lib/main.js", line 17, in openE10sWindow
    let window = getMostRecentBrowserWindow().OpenBrowserWindow({ remote: true });
  File "chrome://browser/content/browser.js", line 12961, in OpenBrowserWindow
    alert("To use out-of-process tabs, you must set the layers.offmainthreadcomposition.enabled preference and restart. Opening a normal window instead.");
  File "resource://gre/components/nsPrompter.js", line 604, in ModalPrompter.prototype.alert
    this.openPrompt(args);
  File "resource://gre/components/nsPrompter.js", line 552, in ModalPrompter.prototype.openPrompt
    openModalWindow(this.domWin, uri, propBag);
  File "resource://gre/components/nsPrompter.js", line 369, in openModalWindow
    Services.ww.openWindow(domWin, uri, "_blank", "centerscreen,chrome,modal,titlebar", args);
  File "resource://extensions.modules.jid1-zzaxfhaplhwbgw-at-jetpack.commonjs.path/sdk/timers.js", line 40, in notify
    callback.apply(null, args);
  File "resource://extensions.modules.jid1-zzaxfhaplhwbgw-at-jetpack.commonjs.path/sdk/deprecated/unit-test.js", line 346, in done/</<
    timer.setTimeout(_ => onDone(this), 0);
  File "resource://extensions.modules.jid1-zzaxfhaplhwbgw-at-jetpack.commonjs.path/sdk/deprecated/unit-test.js", line 511, in start/this.onDone
    options.onDone(self);
  File "resource://extensions.modules.jid1-zzaxfhaplhwbgw-at-jetpack.commonjs.path/sdk/deprecated/unit-test.js", line 491, in runNextTest
    self.start({test: test, onDone: runNextTest});
  File "resource://extensions.modules.jid1-zzaxfhaplhwbgw-at-jetpack.commonjs.path/sdk/deprecated/unit-test.js", line 524, in start
    this.test.testFunction(this);
  File "resource://extensions.modules.jid1-zzaxfhaplhwbgw-at-jetpack.commonjs.path/sdk/test.js", line 68, in null
    test(assert, function() {
  File "resource://jid1-zzaxfhaplhwbgw-at-jetpack/e10s-tabs/lib/main.js", line 28, in makeE10sTests/newExports[key]
    openE10sWindow().then(window => {
  File "resource://jid1-zzaxfhaplhwbgw-at-jetpack/e10s-tabs/lib/main.js", line 17, in openE10sWindow
    let window = getMostRecentBrowserWindow().OpenBrowserWindow({ remote: true });
  File "chrome://browser/content/browser.js", line 12961, in OpenBrowserWindow
    alert("To use out-of-process tabs, you must set the layers.offmainthreadcomposition.enabled preference and restart. Opening a normal window instead.");
  File "resource://gre/components/nsPrompter.js", line 604, in ModalPrompter.prototype.alert
    this.openPrompt(args);
  File "resource://gre/components/nsPrompter.js", line 552, in ModalPrompter.prototype.openPrompt
    openModalWindow(this.domWin, uri, propBag);
  File "resource://gre/components/nsPrompter.js", line 369, in openModalWindow
    Services.ww.openWindow(domWin, uri, "_blank", "centerscreen,chrome,modal,titlebar", args);
  File "resource://gre/modules/Promise-backend.js", line 745, in this.PromiseWalker.walkerLoop
    this.handlers.shift().process();
  File "resource://gre/modules/Promise-backend.js", line 866, in Handler.prototype.process
    nextValue = this.onResolve.call(undefined, nextValue);
  File "resource://extensions.modules.jid1-zzaxfhaplhwbgw-at-jetpack.commonjs.path/sdk/deprecated/unit-test.js", line 318, in done/<
    this.fail("Should not be any unexpected windows open");
  File "resource://extensions.modules.jid1-zzaxfhaplhwbgw-at-jetpack.commonjs.path/sdk/deprecated/unit-test.js", line 92, in fail
    this.console.testMessage(false, false, this.test.name, message);
  File "resource://extensions.modules.jid1-zzaxfhaplhwbgw-at-jetpack.commonjs.path/sdk/test/harness.js", line 527, in testMessage
    this.trace();
TEST-INFO | Windows open:
TEST-INFO | chrome://browser/content/browser.xul - about:blank
TEST-INFO | chrome://global/content/commonDialog.xul
TEST-INFO | chrome://global/content/commonDialog.xul
TEST-END | e10s-tabs/main.test behavior on close
TEST-START | e10s-tabs/main.test current window
TEST-INFO | [JavaScript Error: "syntax error" {file: "http://localhost/extensions-dummy/blocklistURL" line: 1 column: 50 source: "<!DOCTYPE HTML PUBLIC "-//IETF//DTD HTML 2.0//EN">"}]
TEST-UNEXPECTED-FAIL | e10s-tabs/main.test current window | Test timed out
TEST-INFO | Traceback (most recent call last):
  File "resource://extensions.modules.jid1-zzaxfhaplhwbgw-at-jetpack.commonjs.path/sdk/timers.js", line 40, in notify
    callback.apply(null, args);
  File "resource://extensions.modules.jid1-zzaxfhaplhwbgw-at-jetpack.commonjs.path/sdk/test/runner.js", line 36, in runTests/<
    require("../timers").setTimeout(_ => harness.runTests({
  File "resource://extensions.modules.jid1-zzaxfhaplhwbgw-at-jetpack.commonjs.path/sdk/test/harness.js", line 597, in runTests
    nextIteration();
  File "resource://extensions.modules.jid1-zzaxfhaplhwbgw-at-jetpack.commonjs.path/sdk/test/harness.js", line 410, in nextIteration
    checkForEnd();
  File "resource://extensions.modules.jid1-zzaxfhaplhwbgw-at-jetpack.commonjs.path/sdk/test/harness.js", line 419, in checkForEnd
    findAndRunTests(loader, nextIteration);
  File "resource://extensions.modules.jid1-zzaxfhaplhwbgw-at-jetpack.commonjs.path/sdk/test/runner.js", line 117, in findAndRunTests
    runner.startMany({
  File "resource://extensions.modules.jid1-zzaxfhaplhwbgw-at-jetpack.commonjs.path/sdk/deprecated/unit-test.js", line 496, in startMany
    runNextTest(this);
  File "resource://extensions.modules.jid1-zzaxfhaplhwbgw-at-jetpack.commonjs.path/sdk/deprecated/unit-test.js", line 491, in runNextTest
    self.start({test: test, onDone: runNextTest});
  File "resource://extensions.modules.jid1-zzaxfhaplhwbgw-at-jetpack.commonjs.path/sdk/deprecated/unit-test.js", line 524, in start
    this.test.testFunction(this);
  File "resource://extensions.modules.jid1-zzaxfhaplhwbgw-at-jetpack.commonjs.path/sdk/test.js", line 68, in null
    test(assert, function() {
  File "resource://jid1-zzaxfhaplhwbgw-at-jetpack/e10s-tabs/lib/main.js", line 28, in makeE10sTests/newExports[key]
    openE10sWindow().then(window => {
  File "resource://jid1-zzaxfhaplhwbgw
Blocks: e10s-tests
tracking-e10s: --- → +
Zombie, can you look into this? The log linked above won't work since we're past the 30 days that logs are saved.
i believe this is a duplicate of bug 1054482
Status: NEW → RESOLVED
Closed: 8 years ago
Resolution: --- → DUPLICATE
Duplicate of bug: 1054482
You need to log in before you can comment on or make changes to this bug.