If you think a bug might affect users in the 57 release, please set the correct tracking and status flags for Release Management.

Intermittent "SyntaxError: invalid syntax", "make[5]: *** [CSS2Properties.webidl] Error 1" from "Start server"

RESOLVED DUPLICATE of bug 1027450

Status

()

Core
Build Config
RESOLVED DUPLICATE of bug 1027450
3 years ago
3 years ago

People

(Reporter: emorley, Unassigned)

Tracking

({intermittent-failure})

Trunk
x86_64
Linux
intermittent-failure
Points:
---

Firefox Tracking Flags

(Not tracked)

Details

(Reporter)

Description

3 years ago
b2g_mozilla-inbound_linux64_gecko-debug build on 2014-08-20 02:42:36 PDT for push 39b359173637

slave: bld-linux64-spot-430

https://tbpl.mozilla.org/php/getParsedLog.php?id=46343726&tree=Mozilla-Inbound

{
make[5]: Entering directory `/builds/slave/m-in-l64_g-d-00000000000000000/build/obj-firefox/dom/filesystem'
make[5]: Nothing to be done for `export'.
make[5]: Leaving directory `/builds/slave/m-in-l64_g-d-00000000000000000/build/obj-firefox/dom/filesystem'
make -C /builds/slave/m-in-l64_g-d-00000000000000000/build/security/nss/lib/ssl private_export  CC=' python2.7 /builds/slave/m-in-l64_g-d-00000000000000000/build/sccache/sccache.py /tools/gcc-4.7.3-0moz1/bin/gcc' SOURCE_MD_DIR=/builds/slave/m-in-l64_g-d-00000000000000000/build/obj-firefox/dist SOURCE_MDHEADERS_DIR=/builds/slave/m-in-l64_g-d-00000000000000000/build/obj-firefox/dist/include/nspr DIST=/builds/slave/m-in-l64_g-d-00000000000000000/build/obj-firefox/dist NSPR_INCLUDE_DIR=/builds/slave/m-in-l64_g-d-00000000000000000/build/obj-firefox/dist/include/nspr NSPR_LIB_DIR=/builds/slave/m-in-l64_g-d-00000000000000000/build/obj-firefox/dist/lib MOZILLA_CLIENT=1 NO_MDUPDATE=1 NSS_ENABLE_ECC=1 SQLITE_LIB_NAME=nss3 SQLITE_INCLUDE_DIR=/builds/slave/m-in-l64_g-d-00000000000000000/build/obj-firefox/dist/include NSS_DISABLE_DBM=1 topsrcdir='/builds/slave/m-in-l64_g-d-00000000000000000/build' BUILD='/builds/slave/m-in-l64_g-d-00000000000000000/build/obj-firefox/security/$(subst $(topsrcdir)/security/,,$(CURDIR))' BUILD_TREE='$(BUILD)' OBJDIR='$(BUILD)' DEPENDENCIES='$(BUILD)/.deps' SINGLE_SHLIB_DIR='$(BUILD)' SOURCE_XP_DIR=/builds/slave/m-in-l64_g-d-00000000000000000/build/obj-firefox/dist NS_USE_GCC=1 USE_64=1 NSS_ENABLE_ZLIB= PROGRAMS= CHECKLOC= FREEBL_NO_DEPEND=0 FREEBL_LOWHASH=1 NSS_NO_PKCS11_BYPASS=1 PUBLIC_EXPORT_DIR='/builds/slave/m-in-l64_g-d-00000000000000000/build/obj-firefox/dist/include/$(MODULE)' SOURCE_XPHEADERS_DIR='$(SOURCE_XP_DIR)/include/$(MODULE)' MODULE_INCLUDES='$(addprefix -I$(SOURCE_XP_DIR)/include/,$(REQUIRES))' MAKE_OBJDIR='$(INSTALL) -D $(OBJDIR)' TARGETS='$(LIBRARY) $(SHARED_LIBRARY) $(PROGRAM)' NSINSTALL='/builds/slave/m-in-l64_g-d-00000000000000000/build/obj-firefox/config/nsinstall' 
make[6]: Entering directory `/builds/slave/m-in-l64_g-d-00000000000000000/build/security/nss/lib/ssl'
There are no private exports.
make[6]: Leaving directory `/builds/slave/m-in-l64_g-d-00000000000000000/build/security/nss/lib/ssl'
make -C /builds/slave/m-in-l64_g-d-00000000000000000/build/security/nss/lib/smime/../pkcs12 private_export  CC=' python2.7 /builds/slave/m-in-l64_g-d-00000000000000000/build/sccache/sccache.py /tools/gcc-4.7.3-0moz1/bin/gcc' SOURCE_MD_DIR=/builds/slave/m-in-l64_g-d-00000000000000000/build/obj-firefox/dist SOURCE_MDHEADERS_DIR=/builds/slave/m-in-l64_g-d-00000000000000000/build/obj-firefox/dist/include/nspr DIST=/builds/slave/m-in-l64_g-d-00000000000000000/build/obj-firefox/dist NSPR_INCLUDE_DIR=/builds/slave/m-in-l64_g-d-00000000000000000/build/obj-firefox/dist/include/nspr NSPR_LIB_DIR=/builds/slave/m-in-l64_g-d-00000000000000000/build/obj-firefox/dist/lib MOZILLA_CLIENT=1 NO_MDUPDATE=1 NSS_ENABLE_ECC=1 SQLITE_LIB_NAME=nss3 SQLITE_INCLUDE_DIR=/builds/slave/m-in-l64_g-d-00000000000000000/build/obj-firefox/dist/include NSS_DISABLE_DBM=1 topsrcdir='/builds/slave/m-in-l64_g-d-00000000000000000/build' BUILD='/builds/slave/m-in-l64_g-d-00000000000000000/build/obj-firefox/security/$(subst $(topsrcdir)/security/,,$(CURDIR))' BUILD_TREE='$(BUILD)' OBJDIR='$(BUILD)' DEPENDENCIES='$(BUILD)/.deps' SINGLE_SHLIB_DIR='$(BUILD)' SOURCE_XP_DIR=/builds/slave/m-in-l64_g-d-00000000000000000/build/obj-firefox/dist NS_USE_GCC=1 USE_64=1 NSS_ENABLE_ZLIB= PROGRAMS= CHECKLOC= FREEBL_NO_DEPEND=0 FREEBL_LOWHASH=1 NSS_NO_PKCS11_BYPASS=1 PUBLIC_EXPORT_DIR='/builds/slave/m-in-l64_g-d-00000000000000000/build/obj-firefox/dist/include/$(MODULE)' SOURCE_XPHEADERS_DIR='$(SOURCE_XP_DIR)/include/$(MODULE)' MODULE_INCLUDES='$(addprefix -I$(SOURCE_XP_DIR)/include/,$(REQUIRES))' MAKE_OBJDIR='$(INSTALL) -D $(OBJDIR)' TARGETS='$(LIBRARY) $(SHARED_LIBRARY) $(PROGRAM)' NSINSTALL='/builds/slave/m-in-l64_g-d-00000000000000000/build/obj-firefox/config/nsinstall' 
make[6]: Entering directory `/builds/slave/m-in-l64_g-d-00000000000000000/build/security/nss/lib/pkcs12'
There are no private exports.
make[6]: Leaving directory `/builds/slave/m-in-l64_g-d-00000000000000000/build/security/nss/lib/pkcs12'
make -C /builds/slave/m-in-l64_g-d-00000000000000000/build/security/nss/lib/smime/../pkcs7 private_export  CC=' python2.7 /builds/slave/m-in-l64_g-d-00000000000000000/build/sccache/sccache.py /tools/gcc-4.7.3-0moz1/bin/gcc' SOURCE_MD_DIR=/builds/slave/m-in-l64_g-d-00000000000000000/build/obj-firefox/dist SOURCE_MDHEADERS_DIR=/builds/slave/m-in-l64_g-d-00000000000000000/build/obj-firefox/dist/include/nspr DIST=/builds/slave/m-in-l64_g-d-00000000000000000/build/obj-firefox/dist NSPR_INCLUDE_DIR=/builds/slave/m-in-l64_g-d-00000000000000000/build/obj-firefox/dist/include/nspr NSPR_LIB_DIR=/builds/slave/m-in-l64_g-d-00000000000000000/build/obj-firefox/dist/lib MOZILLA_CLIENT=1 NO_MDUPDATE=1 NSS_ENABLE_ECC=1 SQLITE_LIB_NAME=nss3 SQLITE_INCLUDE_DIR=/builds/slave/m-in-l64_g-d-00000000000000000/build/obj-firefox/dist/include NSS_DISABLE_DBM=1 topsrcdir='/builds/slave/m-in-l64_g-d-00000000000000000/build' BUILD='/builds/slave/m-in-l64_g-d-00000000000000000/build/obj-firefox/security/$(subst $(topsrcdir)/security/,,$(CURDIR))' BUILD_TREE='$(BUILD)' OBJDIR='$(BUILD)' DEPENDENCIES='$(BUILD)/.deps' SINGLE_SHLIB_DIR='$(BUILD)' SOURCE_XP_DIR=/builds/slave/m-in-l64_g-d-00000000000000000/build/obj-firefox/dist NS_USE_GCC=1 USE_64=1 NSS_ENABLE_ZLIB= PROGRAMS= CHECKLOC= FREEBL_NO_DEPEND=0 FREEBL_LOWHASH=1 NSS_NO_PKCS11_BYPASS=1 PUBLIC_EXPORT_DIR='/builds/slave/m-in-l64_g-d-00000000000000000/build/obj-firefox/dist/include/$(MODULE)' SOURCE_XPHEADERS_DIR='$(SOURCE_XP_DIR)/include/$(MODULE)' MODULE_INCLUDES='$(addprefix -I$(SOURCE_XP_DIR)/include/,$(REQUIRES))' MAKE_OBJDIR='$(INSTALL) -D $(OBJDIR)' TARGETS='$(LIBRARY) $(SHARED_LIBRARY) $(PROGRAM)' NSINSTALL='/builds/slave/m-in-l64_g-d-00000000000000000/build/obj-firefox/config/nsinstall' 
make[6]: Entering directory `/builds/slave/m-in-l64_g-d-00000000000000000/build/security/nss/lib/pkcs7'
/builds/slave/m-in-l64_g-d-00000000000000000/build/obj-firefox/config/nsinstall -R -m 444 p7local.h /builds/slave/m-in-l64_g-d-00000000000000000/build/obj-firefox/dist/private/nss
make[6]: Leaving directory `/builds/slave/m-in-l64_g-d-00000000000000000/build/security/nss/lib/pkcs7'
make -C /builds/slave/m-in-l64_g-d-00000000000000000/build/security/nss/lib/smime private_export  CC=' python2.7 /builds/slave/m-in-l64_g-d-00000000000000000/build/sccache/sccache.py /tools/gcc-4.7.3-0moz1/bin/gcc' SOURCE_MD_DIR=/builds/slave/m-in-l64_g-d-00000000000000000/build/obj-firefox/dist SOURCE_MDHEADERS_DIR=/builds/slave/m-in-l64_g-d-00000000000000000/build/obj-firefox/dist/include/nspr DIST=/builds/slave/m-in-l64_g-d-00000000000000000/build/obj-firefox/dist NSPR_INCLUDE_DIR=/builds/slave/m-in-l64_g-d-00000000000000000/build/obj-firefox/dist/include/nspr NSPR_LIB_DIR=/builds/slave/m-in-l64_g-d-00000000000000000/build/obj-firefox/dist/lib MOZILLA_CLIENT=1 NO_MDUPDATE=1 NSS_ENABLE_ECC=1 SQLITE_LIB_NAME=nss3 SQLITE_INCLUDE_DIR=/builds/slave/m-in-l64_g-d-00000000000000000/build/obj-firefox/dist/include NSS_DISABLE_DBM=1 topsrcdir='/builds/slave/m-in-l64_g-d-00000000000000000/build' BUILD='/builds/slave/m-in-l64_g-d-00000000000000000/build/obj-firefox/security/$(subst $(topsrcdir)/security/,,$(CURDIR))' BUILD_TREE='$(BUILD)' OBJDIR='$(BUILD)' DEPENDENCIES='$(BUILD)/.deps' SINGLE_SHLIB_DIR='$(BUILD)' SOURCE_XP_DIR=/builds/slave/m-in-l64_g-d-00000000000000000/build/obj-firefox/dist NS_USE_GCC=1 USE_64=1 NSS_ENABLE_ZLIB= PROGRAMS= CHECKLOC= FREEBL_NO_DEPEND=0 FREEBL_LOWHASH=1 NSS_NO_PKCS11_BYPASS=1 PUBLIC_EXPORT_DIR='/builds/slave/m-in-l64_g-d-00000000000000000/build/obj-firefox/dist/include/$(MODULE)' SOURCE_XPHEADERS_DIR='$(SOURCE_XP_DIR)/include/$(MODULE)' MODULE_INCLUDES='$(addprefix -I$(SOURCE_XP_DIR)/include/,$(REQUIRES))' MAKE_OBJDIR='$(INSTALL) -D $(OBJDIR)' TARGETS='$(LIBRARY) $(SHARED_LIBRARY) $(PROGRAM)' NSINSTALL='/builds/slave/m-in-l64_g-d-00000000000000000/build/obj-firefox/config/nsinstall' 
make[6]: Entering directory `/builds/slave/m-in-l64_g-d-00000000000000000/build/security/nss/lib/smime'
/builds/slave/m-in-l64_g-d-00000000000000000/build/obj-firefox/config/nsinstall -R -m 444 cmslocal.h /builds/slave/m-in-l64_g-d-00000000000000000/build/obj-firefox/dist/private/nss
Traceback (most recent call last):
  File "/builds/slave/m-in-l64_g-d-00000000000000000/build/dom/bindings/GenerateCSS2PropertiesWebIDL.py", line 8, in <module>
    propList = eval(sys.stdin.read())
  File "<string>", line 1
    Start server
               ^
SyntaxError: invalid syntax
make[6]: Leaving directory `/builds/slave/m-in-l64_g-d-00000000000000000/build/security/nss/lib/smime'
make -C /builds/slave/m-in-l64_g-d-00000000000000000/build/security/nss/lib/freebl private_export  CC=' python2.7 /builds/slave/m-in-l64_g-d-00000000000000000/build/sccache/sccache.py /tools/gcc-4.7.3-0moz1/bin/gcc' SOURCE_MD_DIR=/builds/slave/m-in-l64_g-d-00000000000000000/build/obj-firefox/dist SOURCE_MDHEADERS_DIR=/builds/slave/m-in-l64_g-d-00000000000000000/build/obj-firefox/dist/include/nspr DIST=/builds/slave/m-in-l64_g-d-00000000000000000/build/obj-firefox/dist NSPR_INCLUDE_DIR=/builds/slave/m-in-l64_g-d-00000000000000000/build/obj-firefox/dist/include/nspr NSPR_LIB_DIR=/builds/slave/m-in-l64_g-d-00000000000000000/build/obj-firefox/dist/lib MOZILLA_CLIENT=1 NO_MDUPDATE=1 NSS_ENABLE_ECC=1 SQLITE_LIB_NAME=nss3 SQLITE_INCLUDE_DIR=/builds/slave/m-in-l64_g-d-00000000000000000/build/obj-firefox/dist/include NSS_DISABLE_DBM=1 topsrcdir='/builds/slave/m-in-l64_g-d-00000000000000000/build' BUILD='/builds/slave/m-in-l64_g-d-00000000000000000/build/obj-firefox/security/$(subst $(topsrcdir)/security/,,$(CURDIR))' BUILD_TREE='$(BUILD)' OBJDIR='$(BUILD)' DEPENDENCIES='$(BUILD)/.deps' SINGLE_SHLIB_DIR='$(BUILD)' SOURCE_XP_DIR=/builds/slave/m-in-l64_g-d-00000000000000000/build/obj-firefox/dist NS_USE_GCC=1 USE_64=1 NSS_ENABLE_ZLIB= PROGRAMS= CHECKLOC= FREEBL_NO_DEPEND=0 FREEBL_LOWHASH=1 NSS_NO_PKCS11_BYPASS=1 PUBLIC_EXPORT_DIR='/builds/slave/m-in-l64_g-d-00000000000000000/build/obj-firefox/dist/include/$(MODULE)' SOURCE_XPHEADERS_DIR='$(SOURCE_XP_DIR)/include/$(MODULE)' MODULE_INCLUDES='$(addprefix -I$(SOURCE_XP_DIR)/include/,$(REQUIRES))' MAKE_OBJDIR='$(INSTALL) -D $(OBJDIR)' TARGETS='$(LIBRARY) $(SHARED_LIBRARY) $(PROGRAM)' NSINSTALL='/builds/slave/m-in-l64_g-d-00000000000000000/build/obj-firefox/config/nsinstall' 
make[5]: *** [CSS2Properties.webidl] Error 1
make[5]: *** Deleting file `CSS2Properties.webidl'
make[5]: Leaving directory `/builds/slave/m-in-l64_g-d-00000000000000000/build/obj-firefox/dom/bindings'
make[4]: *** [dom/bindings/export] Error 2
make[4]: *** Waiting for unfinished jobs...
}

Mike, this looks like ccache again, please could you take a look?
Flags: needinfo?(mh+mozilla)
(Reporter)

Comment 1

3 years ago
https://tbpl.mozilla.org/php/getParsedLog.php?id=46339636&tree=Mozilla-Inbound
(Reporter)

Comment 2

3 years ago
https://tbpl.mozilla.org/php/getParsedLog.php?id=46345719&tree=Mozilla-Inbound
Status: NEW → RESOLVED
Last Resolved: 3 years ago
Flags: needinfo?(mh+mozilla)
Resolution: --- → DUPLICATE
Duplicate of bug: 1027450
(Reporter)

Comment 4

3 years ago
Ah that was the bug I was looking for :-)
Comment hidden (Treeherder Robot)
You need to log in before you can comment on or make changes to this bug.