"No such file or directory" error causing upload failures

RESOLVED FIXED

Status

Release Engineering
Buildduty
--
blocker
RESOLVED FIXED
3 years ago
3 years ago

People

(Reporter: RyanVM, Unassigned)

Tracking

({regression})

Firefox Tracking Flags

(Not tracked)

Details

(Reporter)

Description

3 years ago
Trees are closed.

https://tbpl.mozilla.org/php/getParsedLog.php?id=47232665&tree=B2g-Inbound

bash: -c: line 1: syntax error: unexpected end of file
Uploading /builds/slave/b2g-in-linux32_g-d-00000000000/build/obj-firefox/dist/b2g-34.0a1.en-US.linux-i686.tar.bz2
Uploading /builds/slave/b2g-in-linux32_g-d-00000000000/build/obj-firefox/dist/b2g-34.0a1.en-US.linux-i686.tests.zip
Uploading /builds/slave/b2g-in-linux32_g-d-00000000000/build/obj-firefox/dist/b2g-34.0a1.en-US.linux-i686.crashreporter-symbols.zip
Uploading /builds/slave/b2g-in-linux32_g-d-00000000000/build/obj-firefox/dist/b2g-34.0a1.en-US.linux-i686.txt
Uploading /builds/slave/b2g-in-linux32_g-d-00000000000/build/obj-firefox/dist/b2g-34.0a1.en-US.linux-i686.json
Uploading /builds/slave/b2g-in-linux32_g-d-00000000000/build/obj-firefox/dist/sccache.log.gz
Uploading /builds/slave/b2g-in-linux32_g-d-00000000000/build/obj-firefox/dist/sccache.log.gz
Uploading /builds/slave/b2g-in-linux32_g-d-00000000000/build/obj-firefox/dist/b2g-34.0a1.en-US.linux-i686.checksums
Running post-upload command: post_upload.py --tinderbox-builds-dir b2g-inbound-linux32_gecko-debug -p b2g -i python: can't open file 'build./config/printconfigsetting.py': [Errno 2] No such file or directory --revision ecac3d170dc8 --builddir en-US --release-to-tinderbox-dated-builds --release-to-latest-tinderbox-builds
Command ['ssh', '-o', 'IdentityFile=~/.ssh/ffxbld_dsa', 'ffxbld@stage.mozilla.org', 'post_upload.py --tinderbox-builds-dir b2g-inbound-linux32_gecko-debug -p b2g -i python: can\'t open file \'build./config/printconfigsetting.py\': [Errno 2] No such file or directory --revision ecac3d170dc8 --builddir en-US --release-to-tinderbox-dated-builds --release-to-latest-tinderbox-builds "/tmp/tmp.leS5cckTxZ/" "/tmp/tmp.leS5cckTxZ//b2g-34.0a1.en-US.linux-i686.tar.bz2" "/tmp/tmp.leS5cckTxZ//b2g-34.0a1.en-US.linux-i686.tests.zip" "/tmp/tmp.leS5cckTxZ//b2g-34.0a1.en-US.linux-i686.crashreporter-symbols.zip" "/tmp/tmp.leS5cckTxZ//b2g-34.0a1.en-US.linux-i686.txt" "/tmp/tmp.leS5cckTxZ//b2g-34.0a1.en-US.linux-i686.json" "/tmp/tmp.leS5cckTxZ//sccache.log.gz" "/tmp/tmp.leS5cckTxZ//sccache.log.gz" "/tmp/tmp.leS5cckTxZ//b2g-34.0a1.en-US.linux-i686.checksums"'] returned non-zero exit code: 1
make[1]: *** [upload] Error 2
make[1]: Leaving directory `/builds/slave/b2g-in-linux32_g-d-00000000000/build/obj-firefox/b2g/installer'
make: *** [upload] Error 2
(Reporter)

Comment 1

3 years ago
Also causing graphserver problems:

https://tbpl.mozilla.org/php/getParsedLog.php?id=47233517&tree=Mozilla-Inbound

Executing: ['python', '/builds/slave/m-in-lx-0000000000000000000000/tools/buildfarm/utils/graph_server_post.py', '--server', 'graphs.mozilla.org', '--selector', '/server/collect.cgi', '--branch', 'Mozilla-Inbound', '--buildid', "python: can't open file 'build./config/printconfigsetting.py': [Errno 2] No such file or directory", '--sourcestamp', "python: can't open file 'build./config/printconfigsetting.py': [Errno 2] No such file or directory", '--resultsname', 'Linux_mozilla-inbound', '--properties-file', 'properties.json', '--timestamp', '1409675017']
results not added, response: 
'python: can't open file 'build./config/printconfigsetting.py': [Errno 2] No such file or directory' failed string validation
  File "/var/www/html/graphs/server/pyfomatic/collect.py", line 271, in handleRequest
    metadata = MetaDataFromTalos(databaseCursor, databaseModule, inputStream)
  File "/var/www/html/graphs/server/pyfomatic/collect.py", line 62, in __init__
    self.readFromSource(dataSource)
  File "/var/www/html/graphs/server/pyfomatic/collect.py", line 83, in readFromSource
    raise ImproperFormatException(str(x))


Traceback (most recent call last):
  File "/builds/slave/m-in-lx-0000000000000000000000/tools/buildfarm/utils/graph_server_post.py", line 89, in <module>
    main()
  File "/builds/slave/m-in-lx-0000000000000000000000/tools/buildfarm/utils/graph_server_post.py", line 86, in main
    gp.postResult()
  File "/builds/slave/m-in-lx-0000000000000000000000/tools/buildfarm/utils/graph_server_post.py", line 58, in postResult
    self.doTinderboxPrint(content, testlongname, testname, prettyval)
  File "/builds/slave/m-in-lx-0000000000000000000000/tools/buildfarm/utils/graph_server_post.py", line 38, in doTinderboxPrint
    raise Exception("graph server did not add results successfully")
Exception: graph server did not add results successfully
Here's the fix I pushed:

http://hg.mozilla.org/build/buildbotcustom/rev/1f42254f9cc7
Blocks: 1059511
Keywords: regression
This was fixed yesterday with the change in comment 2.
Status: NEW → RESOLVED
Last Resolved: 3 years ago
Resolution: --- → FIXED
You need to log in before you can comment on or make changes to this bug.