Closed Bug 1513059 Opened 2 years ago Closed 2 years ago

[Socket-process] Do not init the complete XPCOM

Categories

(Core :: Networking, defect, P2)

defect

Tracking

()

RESOLVED FIXED
mozilla66
Fission Milestone M1
Tracking Status
firefox66 --- fixed

People

(Reporter: dragana, Assigned: dragana)

References

(Blocks 2 open bugs)

Details

(Whiteboard: [necko-triaged])

Attachments

(2 files, 1 obsolete file)

No description provided.
Blocks: socket-proc
Assignee: nobody → dd.mozilla
Status: NEW → ASSIGNED
Priority: -- → P2
Whiteboard: [necko-triaged]
Bug 1471535 is interesting to take a look. They needed to do some work to make the rdd process (the MediaDataDecoder process) running.
Duplicate of this bug: 1511318
Attached file Use mininal XPCOM. (obsolete) —
Attachment #9031187 - Attachment is obsolete: true
Keywords: checkin-needed

We're sorry, Autoland could not rebase your commits for you automatically. Please manually rebase your commits and try again. (255, 'applying /tmp/tmpuqasvo\npatching file dom/power/PowerManagerService.cpp\nHunk #2 FAILED at 177\n1 out of 2 hunks FAILED -- saving rejects to file dom/power/PowerManagerService.cpp.rej\nabort: patch failed to apply', '')

Flags: needinfo?(dd.mozilla)
Keywords: checkin-needed

(In reply to Cosmin Sabou [:CosminS] from comment #10)

We're sorry, Autoland could not rebase your commits for you automatically. Please manually rebase your commits and try again. (255, 'applying /tmp/tmpuqasvo\npatching file dom/power/PowerManagerService.cpp\nHunk #2 FAILED at 177\n1 out of 2 hunks FAILED -- saving rejects to file dom/power/PowerManagerService.cpp.rej\nabort: patch failed to apply', '')

Thanks. I have rebased the patch.

Flags: needinfo?(dd.mozilla)
Keywords: checkin-needed

Pushed by aiakab@mozilla.com:
https://hg.mozilla.org/integration/autoland/rev/8d4aa37d7137
Use the minimal XPCOM for the socket process.r=froydnj

Keywords: checkin-needed
Status: ASSIGNED → RESOLVED
Closed: 2 years ago
Resolution: --- → FIXED
Target Milestone: --- → mozilla66
Fission Milestone: --- → M1
You need to log in before you can comment on or make changes to this bug.