Closed Bug 1640057 Opened 4 months ago Closed 4 months ago

Perma condprof Exception: Download failed, no more retries!

Categories

(Firefox Build System :: Task Configuration, defect, P5)

defect

Tracking

(firefox-esr68 unaffected, firefox76 unaffected, firefox77 unaffected, firefox78 fixed)

RESOLVED FIXED
mozilla78
Tracking Status
firefox-esr68 --- unaffected
firefox76 --- unaffected
firefox77 --- unaffected
firefox78 --- fixed

People

(Reporter: intermittent-bug-filer, Assigned: Callek)

References

(Regression)

Details

(Keywords: intermittent-failure, regression)

Attachments

(1 file)

Filed by: csabou [at] mozilla.com
Parsed log: https://treeherder.mozilla.org/logviewer.html#?job_id=303296398&repo=mozilla-central
Full log: https://firefox-ci-tc.services.mozilla.com/api/queue/v1/task/N76h__DKTXm5MG4b7ddsHg/runs/0/artifacts/public/logs/live_backing.log


[fetches 2020-05-21T23:50:11.727Z] Downloading https://firefox-ci-tc.services.mozilla.com/api/queue/v1/task/Seuz9yESSM28pxxML0s80Q/artifacts/public/build/target.condprof.tests.tar.gz
[fetches 2020-05-21T23:50:11.791Z] Download failed: HTTP Error 404: Not Found
[fetches 2020-05-21T23:50:11.792Z] Traceback (most recent call last):
[fetches 2020-05-21T23:50:11.792Z] File "./fetch-content", line 681, in <module>
[fetches 2020-05-21T23:50:11.793Z] sys.exit(main())
[fetches 2020-05-21T23:50:11.793Z] File "./fetch-content", line 677, in main
[fetches 2020-05-21T23:50:11.793Z] return args.func(args)
[fetches 2020-05-21T23:50:11.793Z] File "./fetch-content", line 611, in command_task_artifacts
[fetches 2020-05-21T23:50:11.793Z] fetch_urls(downloads)
[fetches 2020-05-21T23:50:11.793Z] File "./fetch-content", line 482, in fetch_urls
[fetches 2020-05-21T23:50:11.794Z] f.result()
[fetches 2020-05-21T23:50:11.794Z] File "/usr/lib/python3.6/concurrent/futures/_base.py", line 432, in result
[fetches 2020-05-21T23:50:11.794Z] return self.__get_result()
[fetches 2020-05-21T23:50:11.794Z] File "/usr/lib/python3.6/concurrent/futures/_base.py", line 384, in __get_result
[fetches 2020-05-21T23:50:11.794Z] raise self._exception
[fetches 2020-05-21T23:50:11.794Z] File "/usr/lib/python3.6/concurrent/futures/thread.py", line 56, in run
[fetches 2020-05-21T23:50:11.794Z] result = self.fn(*self.args, **self.kwargs)
[fetches 2020-05-21T23:50:11.794Z] File "./fetch-content", line 461, in fetch_and_extract
[fetches 2020-05-21T23:50:11.794Z] download_to_path(url, dest_path, sha256=sha256, size=size)
[fetches 2020-05-21T23:50:11.794Z] File "./fetch-content", line 241, in download_to_path
[fetches 2020-05-21T23:50:11.795Z] raise Exception("Download failed, no more retries!")
[fetches 2020-05-21T23:50:11.795Z] Exception: Download failed, no more retries!
[fetches 2020-05-21T23:50:11.824Z] removing /builds/task_1590104517/fetches
[fetches 2020-05-21T23:50:11.834Z] finished
[taskcluster 2020-05-21T23:50:11.840Z] Exit Code: 1
[taskcluster 2020-05-21T23:50:11.840Z] User Time: 873.926ms
[taskcluster 2020-05-21T23:50:11.840Z] Kernel Time: 416.127ms
[taskcluster 2020-05-21T23:50:11.840Z] Wall Time: 8m11.332207791s
[taskcluster 2020-05-21T23:50:11.840Z] Result: FAILED
[taskcluster 2020-05-21T23:50:11.840Z] === Task Finished ===
[taskcluster 2020-05-21T23:50:11.840Z] Task Duration: 8m11.333937841s
[taskcluster:error] Uploading error artifact public/condprof from file archive with message "Could not read directory '/builds/task_1590104517/archive'", reason "file-missing-on-worker" and expiry 2021-05-21T21:52:53.937Z
[taskcluster:error] TASK FAILURE during artifact upload: file-missing-on-worker: Could not read directory '/builds/task_1590104517/archive'
[taskcluster 2020-05-21T23:50:12.003Z] Uploading redirect artifact public/logs/live.log to URL https://firefox-ci-tc.services.mozilla.com/api/queue/v1/task/N76h__DKTXm5MG4b7ddsHg/runs/0/artifacts/public/logs/live_backing.log with mime type "text/plain; charset=utf-8" and expiry 2021-05-21T21:52:53.937Z
[taskcluster:error] exit status 1

Flags: needinfo?(bugspam.Callek)
Summary: Intermittent condprof Exception: Download failed, no more retries! → Perma condprof Exception: Download failed, no more retries!

Bugbug thinks this bug should belong to this component, but please revert this change in case of error.

Component: General → Task Configuration
Assignee: nobody → bugspam.Callek
Status: NEW → ASSIGNED
Flags: needinfo?(bugspam.Callek)
Pushed by jwood@mozilla.com:
https://hg.mozilla.org/integration/autoland/rev/cdc1527ee98f
Make condition profile fetch use the correct directory (en-US from shippable). r=aki
Status: ASSIGNED → RESOLVED
Closed: 4 months ago
Resolution: --- → FIXED
Target Milestone: --- → mozilla78

Set release status flags based on info from the regressing bug 1623355

You need to log in before you can comment on or make changes to this bug.