win64 is failing to compile since March. 30th

RESOLVED DUPLICATE of bug 646704

Status

Firefox Build System
General
RESOLVED DUPLICATE of bug 646704
7 years ago
5 months ago

People

(Reporter: armenzg, Unassigned)

Tracking

Trunk
x86_64
Windows Server 2008

Firefox Tracking Flags

(Not tracked)

Details

(Reporter)

Description

7 years ago
d:/mozilla-build/python/python2.6.exe /e/builds/moz2_slave/cen-win64-ntly/build/config/pythonpath.py -I../../config /e/builds/moz2_slave/cen-win64-ntly/build/config/expandlibs_exec.py --uselist -- link -NOLOGO -DLL -OUT:xul.dll -PDB:xul.pdb -SUBSYSTEM:WINDOWS  dlldeps-xul.obj nsStaticXULComponents.obj nsDllMain.obj dlldeps.obj nsGFXDeps.obj dlldeps-zlib.obj nsUnicharUtils.obj nsBidiUtils.obj nsRDFResource.obj    ./module.res -LARGEADDRESSAWARE -NXCOMPAT -DYNAMICBASE  -DEBUG -DEBUGTYPE:CV -MANIFEST:NO -LIBPATH:"e:/builds/moz2_slave/cen-win64-ntly/build/obj-firefox/memory/jemalloc/crtsrc/build/amd64" -NODEFAULTLIB:msvcrt -NODEFAULTLIB:msvcrtd -NODEFAULTLIB:msvcprt -NODEFAULTLIB:msvcprtd -DEFAULTLIB:mozcrt19 -DEFAULTLIB:mozcpp19 -DEBUG -OPT:REF,ICF -LTCG:PGINSTRUMENT   ../../toolkit/xre/xulapp_s.lib  ../../staticlib/components/necko.lib ../../staticlib/components/uconv.lib ../../staticlib/components/i18n.lib ../../staticlib/components/chardet.lib ../../staticlib/components/jar50.lib ../../staticlib/components/startupcache.lib ../../staticlib/components/pref.lib ../../staticlib/components/htmlpars.lib ../../staticlib/components/imglib2.lib ../../staticlib/components/gkgfx.lib ../../staticlib/components/gklayout.lib ../../staticlib/components/docshell.lib ../../staticlib/components/embedcomponents.lib ../../staticlib/components/webbrwsr.lib ../../staticlib/components/nsappshell.lib ../../staticlib/components/txmgr.lib ../../staticlib/components/commandlines.lib ../../staticlib/components/toolkitcomps.lib ../../staticlib/components/pipboot.lib ../../staticlib/components/pipnss.lib ../../staticlib/components/appcomps.lib ../../staticlib/components/composer.lib ../../staticlib/components/jetpack_s.lib ../../staticlib/components/jsctypes.lib ../../staticlib/components/jsperf.lib ../../staticlib/components/gkplugin.lib ../../staticlib/components/windowsproxy.lib ../../staticlib/components/jsd.lib ../../staticlib/components/autoconfig.lib ../../staticlib/components/auth.lib ../../staticlib/components/cookie.lib ../../staticlib/components/permissions.lib ../../staticlib/components/universalchardet.lib ../../staticlib/components/rdf.lib ../../staticlib/components/windowds.lib ../../staticlib/components/storagecomps.lib ../../staticlib/components/places.lib ../../staticlib/components/tkautocomplete.lib ../../staticlib/components/satchel.lib ../../staticlib/components/pippki.lib ../../staticlib/components/imgicon.lib ../../staticlib/components/gkwidget.lib ../../staticlib/components/accessibility.lib ../../staticlib/components/spellchecker.lib ../../staticlib/components/zipwriter.lib ../../staticlib/components/services-crypto.lib ../../staticlib/jsipc_s.lib ../../staticlib/domipc_s.lib ../../staticlib/domplugins_s.lib ../../staticlib/mozipc_s.lib ../../staticlib/mozipdlgen_s.lib ../../staticlib/ipcshell_s.lib ../../staticlib/gfxipc_s.lib ../../staticlib/xpcom_core.lib ../../staticlib/ucvutil_s.lib ../../staticlib/chromium_s.lib ../../staticlib/mozreg_s.lib ../../staticlib/morkreader_s.lib ../../staticlib/thebes.lib ../../staticlib/ycbcr.lib ../../staticlib/angle.lib  ../../dist/lib/mozsqlite3.lib  ../../jpeg/jpeg3250.lib ../../modules/libimg/png/png.lib ../../gfx/qcms/mozqcms.lib e:/builds/moz2_slave/cen-win64-ntly/build/obj-firefox/dist/lib/js_static.lib e:/builds/moz2_slave/cen-win64-ntly/build/obj-firefox/dist/lib/crmf.lib         e:/builds/moz2_slave/cen-win64-ntly/build/obj-firefox/dist/lib/smime3.lib         e:/builds/moz2_slave/cen-win64-ntly/build/obj-firefox/dist/lib/ssl3.lib         e:/builds/moz2_slave/cen-win64-ntly/build/obj-firefox/dist/lib/nss3.lib         e:/builds/moz2_slave/cen-win64-ntly/build/obj-firefox/dist/lib/nssutil3.lib ../../gfx/cairo/cairo/src/mozcairo.lib  ../../gfx/cairo/libpixman/src/mozlibpixman.lib ../../gfx/harfbuzz/src/mozharfbuzz.lib ../../gfx/ots/src/mozots.lib   ../../modules/zlib/src/mozz.lib   e:/builds/moz2_slave/cen-win64-ntly/build/obj-firefox/dist/lib/nspr4.lib e:/builds/moz2_slave/cen-win64-ntly/build/obj-firefox/dist/lib/plc4.lib e:/builds/moz2_slave/cen-win64-ntly/build/obj-firefox/dist/lib/plds4.lib  ../../dist/lib/mozalloc.lib kernel32.lib user32.lib gdi32.lib winmm.lib wsock32.lib advapi32.lib shell32.lib ole32.lib uuid.lib version.lib winspool.lib comdlg32.lib imm32.lib winmm.lib wsock32.lib msimg32.lib shlwapi.lib psapi.lib ws2_32.lib dbghelp.lib wininet.lib  usp10.lib oleaut32.lib   
warning C4743: 'const std::logic_error::`vftable'' has different size in 'e:\builds\moz2_slave\cen-win64-ntly\build\toolkit\crashreporter\google-breakpad\src\common\windows\http_upload.cc' and 'e:\builds\moz2_slave\cen-win64-ntly\build\toolkit\crashreporter\nsExceptionHandler.cpp': 16 and 24 bytes
warning C4743: 'const std::length_error::`vftable'' has different size in 'e:\builds\moz2_slave\cen-win64-ntly\build\toolkit\crashreporter\google-breakpad\src\common\windows\http_upload.cc' and 'e:\builds\moz2_slave\cen-win64-ntly\build\toolkit\crashreporter\nsExceptionHandler.cpp': 16 and 24 bytes
   Creating library xul.lib and object xul.exp
jsimd_x86_64.obj : error LNK2001: unresolved external symbol jsimd_h2v2_extrgb_merged_upsample_sse2
jsimd_x86_64.obj : error LNK2001: unresolved external symbol jsimd_fdct_islow_sse2
jsimd_x86_64.obj : error LNK2001: unresolved external symbol jsimd_extbgr_ycc_convert_sse2
jsimd_x86_64.obj : error LNK2001: unresolved external symbol jsimd_ycc_extrgb_convert_sse2
jsimd_x86_64.obj : error LNK2001: unresolved external symbol jconst_idct_red_sse2
jsimd_x86_64.obj : error LNK2001: unresolved external symbol jconst_fdct_float_sse
jsimd_x86_64.obj : error LNK2001: unresolved external symbol jconst_merged_upsample_sse2
jsimd_x86_64.obj : error LNK2001: unresolved external symbol jsimd_convsamp_float_sse2
jsimd_x86_64.obj : error LNK2001: unresolved external symbol jsimd_h2v1_extrgbx_merged_upsample_sse2
jsimd_x86_64.obj : error LNK2001: unresolved external symbol jsimd_h2v2_extbgr_merged_upsample_sse2
jsimd_x86_64.obj : error LNK2001: unresolved external symbol jsimd_h2v1_fancy_upsample_sse2
jsimd_x86_64.obj : error LNK2001: unresolved external symbol jconst_fancy_upsample_sse2
jsimd_x86_64.obj : error LNK2001: unresolved external symbol jsimd_idct_islow_sse2
jsimd_x86_64.obj : error LNK2001: unresolved external symbol jsimd_convsamp_sse2
jsimd_x86_64.obj : error LNK2001: unresolved external symbol jsimd_h2v2_fancy_upsample_sse2
jsimd_x86_64.obj : error LNK2001: unresolved external symbol jsimd_ycc_extbgr_convert_sse2
jsimd_x86_64.obj : error LNK2001: unresolved external symbol jconst_idct_ifast_sse2
jsimd_x86_64.obj : error LNK2001: unresolved external symbol jconst_idct_islow_sse2
jsimd_x86_64.obj : error LNK2001: unresolved external symbol jsimd_h2v2_downsample_sse2
jsimd_x86_64.obj : error LNK2001: unresolved external symbol jsimd_ycc_extrgbx_convert_sse2
jsimd_x86_64.obj : error LNK2001: unresolved external symbol jsimd_extxbgr_ycc_convert_sse2
jsimd_x86_64.obj : error LNK2001: unresolved external symbol jconst_fdct_islow_sse2
jsimd_x86_64.obj : error LNK2001: unresolved external symbol jsimd_h2v1_merged_upsample_sse2
jsimd_x86_64.obj : error LNK2001: unresolved external symbol jconst_idct_float_sse2
jsimd_x86_64.obj : error LNK2001: unresolved external symbol jsimd_h2v1_downsample_sse2
jsimd_x86_64.obj : error LNK2001: unresolved external symbol jsimd_h2v2_upsample_sse2
jsimd_x86_64.obj : error LNK2001: unresolved external symbol jsimd_h2v1_extxbgr_merged_upsample_sse2
jsimd_x86_64.obj : error LNK2001: unresolved external symbol jsimd_h2v1_extxrgb_merged_upsample_sse2
jsimd_x86_64.obj : error LNK2001: unresolved external symbol jsimd_ycc_extxbgr_convert_sse2
jsimd_x86_64.obj : error LNK2001: unresolved external symbol jconst_rgb_ycc_convert_sse2
jsimd_x86_64.obj : error LNK2001: unresolved external symbol jsimd_ycc_extbgrx_convert_sse2
jsimd_x86_64.obj : error LNK2001: unresolved external symbol jsimd_ycc_extxrgb_convert_sse2
jsimd_x86_64.obj : error LNK2001: unresolved external symbol jsimd_idct_4x4_sse2
jsimd_x86_64.obj : error LNK2001: unresolved external symbol jsimd_h2v1_extrgb_merged_upsample_sse2
jsimd_x86_64.obj : error LNK2001: unresolved external symbol jsimd_h2v1_extbgrx_merged_upsample_sse2
jsimd_x86_64.obj : error LNK2001: unresolved external symbol jsimd_extbgrx_ycc_convert_sse2
jsimd_x86_64.obj : error LNK2001: unresolved external symbol jsimd_extrgbx_ycc_convert_sse2
jsimd_x86_64.obj : error LNK2001: unresolved external symbol jconst_ycc_rgb_convert_sse2
jsimd_x86_64.obj : error LNK2001: unresolved external symbol jsimd_quantize_float_sse2
jsimd_x86_64.obj : error LNK2001: unresolved external symbol jsimd_quantize_sse2
jsimd_x86_64.obj : error LNK2001: unresolved external symbol jsimd_h2v2_extbgrx_merged_upsample_sse2
jsimd_x86_64.obj : error LNK2001: unresolved external symbol jsimd_h2v1_extbgr_merged_upsample_sse2
jsimd_x86_64.obj : error LNK2001: unresolved external symbol jsimd_fdct_ifast_sse2
jsimd_x86_64.obj : error LNK2001: unresolved external symbol jsimd_ycc_rgb_convert_sse2
jsimd_x86_64.obj : error LNK2001: unresolved external symbol jsimd_h2v2_extxbgr_merged_upsample_sse2
jsimd_x86_64.obj : error LNK2001: unresolved external symbol jsimd_rgb_ycc_convert_sse2
jsimd_x86_64.obj : error LNK2001: unresolved external symbol jsimd_fdct_float_sse
jsimd_x86_64.obj : error LNK2001: unresolved external symbol jsimd_extrgb_ycc_convert_sse2
jsimd_x86_64.obj : error LNK2001: unresolved external symbol jsimd_h2v2_extxrgb_merged_upsample_sse2
jsimd_x86_64.obj : error LNK2001: unresolved external symbol jsimd_idct_2x2_sse2
jsimd_x86_64.obj : error LNK2001: unresolved external symbol jsimd_extxrgb_ycc_convert_sse2
jsimd_x86_64.obj : error LNK2001: unresolved external symbol jsimd_idct_ifast_sse2
jsimd_x86_64.obj : error LNK2001: unresolved external symbol jsimd_h2v1_upsample_sse2
jsimd_x86_64.obj : error LNK2001: unresolved external symbol jsimd_idct_float_sse2
jsimd_x86_64.obj : error LNK2001: unresolved external symbol jsimd_h2v2_extrgbx_merged_upsample_sse2
jsimd_x86_64.obj : error LNK2001: unresolved external symbol jconst_fdct_ifast_sse2
jsimd_x86_64.obj : error LNK2001: unresolved external symbol jsimd_h2v2_merged_upsample_sse2
xul.dll : fatal error LNK1120: 57 unresolved externals
make[5]: Leaving directory `/e/builds/moz2_slave/cen-win64-ntly/build/obj-firefox/toolkit/library'
make[4]: Leaving directory `/e/builds/moz2_slave/cen-win64-ntly/build/obj-firefox'
make[3]: Leaving directory `/e/builds/moz2_slave/cen-win64-ntly/build/obj-firefox'
make[2]: Leaving directory `/e/builds/moz2_slave/cen-win64-ntly/build/obj-firefox'
make[1]: Leaving directory `/e/builds/moz2_slave/cen-win64-ntly/build'
make[5]: *** [xul.dll] Error 96
make[4]: *** [libs_tier_platform] Error 2
make[3]: *** [tier_platform] Error 2
make[2]: *** [default] Error 2
make[1]: *** [realbuild] Error 2
make: *** [profiledbuild] Error 2
Status: NEW → RESOLVED
Last Resolved: 7 years ago
Resolution: --- → DUPLICATE
Duplicate of bug: 646704
Even if bug 646704 is laded, PGO will be failure due to bug 636296 until  tracemonkey repository is merged.

Updated

5 months ago
Product: Core → Firefox Build System
You need to log in before you can comment on or make changes to this bug.