Closed Bug 659718 Opened 9 years ago Closed 9 years ago

OS X mobile nightly fails during optimizejars.py

Categories

(Firefox Build System :: General, defect)

defect
Not set

Tracking

(firefox6 fixed, fennec6+)

RESOLVED FIXED
mozilla6
Tracking Status
firefox6 --- fixed
fennec 6+ ---

People

(Reporter: mfinkle, Assigned: mwu)

Details

(Keywords: regression)

Attachments

(1 file)

IOError: [Errno 2] No such file or directory: '../../dist/fennec/chrome/chrome.jar'
make[2]: *** [stage-package] Error 1
make[1]: *** [default] Error 2
make: *** [package] Error 2

Seems to be happening on nightly and aurora
Assignee: nobody → mwu
This regressed between the 5/23 nightly build and the 5/24 nightly build.  Regression range:
http://hg.mozilla.org/mozilla-central/pushloghtml?fromchange=0f9347d40121&tochange=bb5904c365a2
tracking-fennec: --- → ?
Keywords: regression
This was always broken, but recent changes in bug 600241 made the brokenness actually matter on jar packaged builds.
Attachment #535462 - Flags: review?(ted.mielczarek)
The proposed patch fixes BlueGriffon's universal build on Mac OS X that
failed during postflight_all because of optimizejars.py.
Thanks mwu !!!
OS: Linux → All
Hardware: x86 → All
Component: General → Build Config
Product: Fennec → Core
QA Contact: general → build-config
tracking-fennec: ? → 7+
tracking-fennec: 7+ → 6+
Attachment #535462 - Flags: review?(ted.mielczarek) → review+
http://hg.mozilla.org/mozilla-central/rev/941ceabc5417
Status: NEW → RESOLVED
tracking-fennec: 6+ → ?
Closed: 9 years ago
Resolution: --- → FIXED
Attachment #535462 - Flags: approval-mozilla-aurora?
Target Milestone: --- → mozilla7
Attachment #535462 - Flags: approval-mozilla-aurora? → approval-mozilla-aurora+
tracking-fennec: ? → 6+
Product: Core → Firefox Build System
You need to log in before you can comment on or make changes to this bug.